BDBM50279009 5-(4-chlorophenyl)-1-(2,4-dichlorophenyl)-N-(2-(dimethylamino)-2-methylpropanoyl)-4-methyl-1H-pyrazole-3-carboxamide::CHEMBL526467
SMILES: CN(C)C(C)(C)C(=O)NC(=O)c1nn(c(c1C)-c1ccc(Cl)cc1)-c1ccc(Cl)cc1Cl
InChI Key: InChIKey=RZFOQCSWONKABC-UHFFFAOYSA-N
Data: 1 IC50
Activity Spreadsheet -- Enzyme Inhibition Constant Data from BindingDB
Found 1 hit for monomerid = 50279009
Trg + Lig
Ki
nM
ΔG°
kcal/mole
IC50
nM
Kd
nM
EC50/IC50
nM
koff
s-1
kon
M-1s-1
pHTemp
°C
Cannabinoid receptor 1
(Homo sapiens (Human))
BDBM50279009
(5-(4-chlorophenyl)-1-(2,4-dichlorophenyl)-N-(2-(di...)
Show SMILES CN(C)C(C)(C)C(=O)NC(=O)c1nn(c(c1C)-c1ccc(Cl)cc1)-c1ccc(Cl)cc1Cl
Show InChI InChI=1S/C23H23Cl3N4O2/c1-13-19(21(31)27-22(32)23(2,3)29(4)5)28-30(18-11-10-16(25)12-17(18)26)20(13)14-6-8-15(24)9-7-14/h6-12H,1-5H3,(H,27,31,32)
NCI pathway
Reactome pathway
n/an/a 82.9n/an/an/an/an/an/a
National Health Research Institutes
Curated by ChEMBL
Assay Description
Displacement of [3H]CP55940 from human recombinant CB1R expressed in HEK293 cells
J Med Chem 52: 4496-510 (2009)
Article DOI: 10.1021/jm900471u
BindingDB Entry DOI: 10.7270/Q26W99Z4