BDBM50279163 CHEMBL1203981::CHEMBL496861
SMILES: CN(C)C(=O)c1ccc2C(C(=Nc3ccc(CN4CCCCC4)cc3)c3ccccc3)C(=O)Nc2c1
InChI Key: InChIKey=TVJQCMWECHMREF-UHFFFAOYSA-N
Data: 2 IC50  1 EC50
Activity Spreadsheet -- Enzyme Inhibition Constant Data from BindingDB
Found 3 hits for monomerid = 50279163
Trg + Lig
Ki
nM
ΔG°
kcal/mole
IC50
nM
Kd
nM
EC50/IC50
nM
koff
s-1
kon
M-1s-1
pHTemp
°C
TGF-beta receptor type-1
(Homo sapiens (Human))
BDBM50279163
(CHEMBL1203981 | CHEMBL496861)
Show SMILES CN(C)C(=O)c1ccc2C(C(=Nc3ccc(CN4CCCCC4)cc3)c3ccccc3)C(=O)Nc2c1 |w:11.11|
Show InChI InChI=1S/C30H32N4O2/c1-33(2)30(36)23-13-16-25-26(19-23)32-29(35)27(25)28(22-9-5-3-6-10-22)31-24-14-11-21(12-15-24)20-34-17-7-4-8-18-34/h3,5-6,9-16,19,27H,4,7-8,17-18,20H2,1-2H3,(H,32,35)
n/an/an/an/a 246n/an/an/an/a
Boehringer Ingelheim Pharma GmbH& Co KG
Curated by ChEMBL
Assay Description
Inhibition of TGFbeta receptor in human HaCaT cells assessed as Smad phosphorylation by ELISA
J Med Chem 53: 7287-95 (2010)
Article DOI: 10.1021/jm100812a
BindingDB Entry DOI: 10.7270/Q2F47PCW
Vascular endothelial growth factor receptor 2
(Homo sapiens (Human))
BDBM50279163
(CHEMBL1203981 | CHEMBL496861)
Show SMILES CN(C)C(=O)c1ccc2C(C(=Nc3ccc(CN4CCCCC4)cc3)c3ccccc3)C(=O)Nc2c1 |w:11.11|
Show InChI InChI=1S/C30H32N4O2/c1-33(2)30(36)23-13-16-25-26(19-23)32-29(35)27(25)28(22-9-5-3-6-10-22)31-24-14-11-21(12-15-24)20-34-17-7-4-8-18-34/h3,5-6,9-16,19,27H,4,7-8,17-18,20H2,1-2H3,(H,32,35)
NCI pathway
Reactome pathway
n/an/a 1.31E+3n/an/an/an/an/an/a
Boehringer Ingelheim Pharma GmbH&Co KG
Curated by ChEMBL
Assay Description
Inhibition of human VEGFR2 expressed in Sf9 cells
J Med Chem 52: 4466-80 (2009)
Article DOI: 10.1021/jm900431g
BindingDB Entry DOI: 10.7270/Q2RB75JS
TGF-beta receptor type-1
(Homo sapiens (Human))
BDBM50279163
(CHEMBL1203981 | CHEMBL496861)
Show SMILES CN(C)C(=O)c1ccc2C(C(=Nc3ccc(CN4CCCCC4)cc3)c3ccccc3)C(=O)Nc2c1 |w:11.11|
Show InChI InChI=1S/C30H32N4O2/c1-33(2)30(36)23-13-16-25-26(19-23)32-29(35)27(25)28(22-9-5-3-6-10-22)31-24-14-11-21(12-15-24)20-34-17-7-4-8-18-34/h3,5-6,9-16,19,27H,4,7-8,17-18,20H2,1-2H3,(H,32,35)
n/an/a 35n/an/an/an/an/an/a
Boehringer Ingelheim Pharma GmbH& Co KG
Curated by ChEMBL
Assay Description
Inhibition of TGFbeta receptor
J Med Chem 53: 7287-95 (2010)
Article DOI: 10.1021/jm100812a
BindingDB Entry DOI: 10.7270/Q2F47PCW