BDBM50279240 2-[5-(4-Chloro-phenyl)-1-(2,4-dichloro-phenyl)-4-ethyl-1Hpyrazol-3-yl]-3,5,5-trimethyl-3,5-dihydro-imidazol-4-one::CHEMBL522904
SMILES: CCc1c(nn(c1-c1ccc(Cl)cc1)-c1ccc(Cl)cc1Cl)C1=NC(C)(C)C(=O)N1C
InChI Key: InChIKey=USNWJHORIWPSKG-UHFFFAOYSA-N
Data: 2 IC50  1 EC50
Activity Spreadsheet -- Enzyme Inhibition Constant Data from BindingDB
Found 3 hits for monomerid = 50279240
Trg + Lig
Ki
nM
ΔG°
kcal/mole
IC50
nM
Kd
nM
EC50/IC50
nM
koff
s-1
kon
M-1s-1
pHTemp
°C
Cannabinoid receptor 1
(Homo sapiens (Human))
BDBM50279240
(2-[5-(4-Chloro-phenyl)-1-(2,4-dichloro-phenyl)-4-e...)
Show SMILES CCc1c(nn(c1-c1ccc(Cl)cc1)-c1ccc(Cl)cc1Cl)C1=NC(C)(C)C(=O)N1C |t:25|
Show InChI InChI=1S/C23H21Cl3N4O/c1-5-16-19(21-27-23(2,3)22(31)29(21)4)28-30(18-11-10-15(25)12-17(18)26)20(16)13-6-8-14(24)9-7-13/h6-12H,5H2,1-4H3
NCI pathway
Reactome pathway
n/an/a 33.8n/an/an/an/an/an/a
National Health Research Institutes
Curated by ChEMBL
Assay Description
Displacement of [3H]CP55940 from human recombinant CB1R expressed in HEK293 cells
J Med Chem 52: 4496-510 (2009)
Article DOI: 10.1021/jm900471u
BindingDB Entry DOI: 10.7270/Q26W99Z4
Cannabinoid receptor 1
(Homo sapiens (Human))
BDBM50279240
(2-[5-(4-Chloro-phenyl)-1-(2,4-dichloro-phenyl)-4-e...)
Show SMILES CCc1c(nn(c1-c1ccc(Cl)cc1)-c1ccc(Cl)cc1Cl)C1=NC(C)(C)C(=O)N1C |t:25|
Show InChI InChI=1S/C23H21Cl3N4O/c1-5-16-19(21-27-23(2,3)22(31)29(21)4)28-30(18-11-10-15(25)12-17(18)26)20(16)13-6-8-14(24)9-7-13/h6-12H,5H2,1-4H3
NCI pathway
Reactome pathway
n/an/an/an/a 65.5n/an/an/an/a
National Health Research Institutes
Curated by ChEMBL
Assay Description
Inverse agonist activity at human recombinant CB1R expressed in HEK293 cells assessed as inhibition of CP55940-stimulated Eu-GTP binding
J Med Chem 52: 4496-510 (2009)
Article DOI: 10.1021/jm900471u
BindingDB Entry DOI: 10.7270/Q26W99Z4
Cannabinoid receptor 2
(Homo sapiens (Human))
BDBM50279240
(2-[5-(4-Chloro-phenyl)-1-(2,4-dichloro-phenyl)-4-e...)
Show SMILES CCc1c(nn(c1-c1ccc(Cl)cc1)-c1ccc(Cl)cc1Cl)C1=NC(C)(C)C(=O)N1C |t:25|
Show InChI InChI=1S/C23H21Cl3N4O/c1-5-16-19(21-27-23(2,3)22(31)29(21)4)28-30(18-11-10-15(25)12-17(18)26)20(16)13-6-8-14(24)9-7-13/h6-12H,5H2,1-4H3
Reactome pathway
n/an/a 4.33E+3n/an/an/an/an/an/a
National Health Research Institutes
Curated by ChEMBL
Assay Description
Displacement of [3H]CP55940 from human recombinant CB2R expressed in HEK293 cells
J Med Chem 52: 4496-510 (2009)
Article DOI: 10.1021/jm900471u
BindingDB Entry DOI: 10.7270/Q26W99Z4