BDBM50279477 4-(2-chlorophenyl)-9-hydroxy-6-(3-morpholino-3-oxopropyl)pyrrolo[3,4-c]carbazole-1,3(2H,6H)-dione::CHEMBL486100
SMILES: Oc1ccc2n(CCC(=O)N3CCOCC3)c3cc(c4C(=O)NC(=O)c4c3c2c1)-c1ccccc1Cl
InChI Key: InChIKey=QURNXQBMNGUUHO-UHFFFAOYSA-N
Data: 1 IC50
Activity Spreadsheet -- Enzyme Inhibition Constant Data from BindingDB
Found 1 hit for monomerid = 50279477
Trg + Lig
Ki
nM
ΔG°
kcal/mole
IC50
nM
Kd
nM
EC50/IC50
nM
koff
s-1
kon
M-1s-1
pHTemp
°C
Serine/threonine-protein kinase WEE1
(Homo sapiens (Human))
BDBM50279477
(4-(2-chlorophenyl)-9-hydroxy-6-(3-morpholino-3-oxo...)
Show SMILES Oc1ccc2n(CCC(=O)N3CCOCC3)c3cc(c4C(=O)NC(=O)c4c3c2c1)-c1ccccc1Cl
Show InChI InChI=1S/C27H22ClN3O5/c28-19-4-2-1-3-16(19)17-14-21-23(25-24(17)26(34)29-27(25)35)18-13-15(32)5-6-20(18)31(21)8-7-22(33)30-9-11-36-12-10-30/h1-6,13-14,32H,7-12H2,(H,29,34,35)
NCI pathway
Reactome pathway
n/an/a 65n/an/an/an/an/an/a
Chulalongkorn University
Curated by ChEMBL
Assay Description
Inhibition of human Wee1
Eur J Med Chem 44: 1383-95 (2009)
Article DOI: 10.1016/j.ejmech.2008.09.027
BindingDB Entry DOI: 10.7270/Q2X34XB6