BDBM50279497 6-(4-(1H-imidazol-1-yl)-4-oxobutyl)-4-(2-chlorophenyl)-9-hydroxypyrrolo[3,4-c]carbazole-1,3(2H,6H)-dione::CHEMBL530112
SMILES: Oc1ccc2n(CCCC(=O)n3ccnc3)c3cc(c4C(=O)NC(=O)c4c3c2c1)-c1ccccc1Cl
InChI Key: InChIKey=FOPCMKRPHIRJHT-UHFFFAOYSA-N
Data: 1 IC50
Activity Spreadsheet -- Enzyme Inhibition Constant Data from BindingDB
Found 1 hit for monomerid = 50279497
Trg + Lig
Ki
nM
ΔG°
kcal/mole
IC50
nM
Kd
nM
EC50/IC50
nM
koff
s-1
kon
M-1s-1
pHTemp
°C
Serine/threonine-protein kinase WEE1
(Homo sapiens (Human))
BDBM50279497
(6-(4-(1H-imidazol-1-yl)-4-oxobutyl)-4-(2-chlorophe...)
Show SMILES Oc1ccc2n(CCCC(=O)n3ccnc3)c3cc(c4C(=O)NC(=O)c4c3c2c1)-c1ccccc1Cl
Show InChI InChI=1S/C27H19ClN4O4/c28-19-5-2-1-4-16(19)17-13-21-23(25-24(17)26(35)30-27(25)36)18-12-15(33)7-8-20(18)32(21)10-3-6-22(34)31-11-9-29-14-31/h1-2,4-5,7-9,11-14,33H,3,6,10H2,(H,30,35,36)
NCI pathway
Reactome pathway
n/an/a 54n/an/an/an/an/an/a
Chulalongkorn University
Curated by ChEMBL
Assay Description
Inhibition of human Wee1
Eur J Med Chem 44: 1383-95 (2009)
Article DOI: 10.1016/j.ejmech.2008.09.027
BindingDB Entry DOI: 10.7270/Q2X34XB6