BDBM50279538 8-(3-(1H-pyrrol-1-yl)propylsulfonyl)-4-(2-chlorophenyl)-9-hydroxy-6-methylpyrrolo[3,4-c]carbazole-1,3(2H,6H)-dione::CHEMBL520984
SMILES: Cn1c2cc(c(O)cc2c2c3C(=O)NC(=O)c3c(cc12)-c1ccccc1Cl)S(=O)(=O)CCCn1cccc1
InChI Key: InChIKey=GUZWUEBRADTPMC-UHFFFAOYSA-N
Data: 1 IC50
Activity Spreadsheet -- Enzyme Inhibition Constant Data from BindingDB
Found 1 hit for monomerid = 50279538
Trg + Lig
Ki
nM
ΔG°
kcal/mole
IC50
nM
Kd
nM
EC50/IC50
nM
koff
s-1
kon
M-1s-1
pHTemp
°C
Serine/threonine-protein kinase WEE1
(Homo sapiens (Human))
BDBM50279538
(8-(3-(1H-pyrrol-1-yl)propylsulfonyl)-4-(2-chloroph...)
Show SMILES Cn1c2cc(c(O)cc2c2c3C(=O)NC(=O)c3c(cc12)-c1ccccc1Cl)S(=O)(=O)CCCn1cccc1
Show InChI InChI=1S/C28H22ClN3O5S/c1-31-20-15-23(38(36,37)12-6-11-32-9-4-5-10-32)22(33)14-18(20)24-21(31)13-17(16-7-2-3-8-19(16)29)25-26(24)28(35)30-27(25)34/h2-5,7-10,13-15,33H,6,11-12H2,1H3,(H,30,34,35)
NCI pathway
Reactome pathway
n/an/a 160n/an/an/an/an/an/a
Chulalongkorn University
Curated by ChEMBL
Assay Description
Inhibition of human Wee1
Eur J Med Chem 44: 1383-95 (2009)
Article DOI: 10.1016/j.ejmech.2008.09.027
BindingDB Entry DOI: 10.7270/Q2X34XB6