BDBM50279740 1-(2,3-dihydro-6-propoxychromen-4-ylideneamino)-3-(4-(piperidin-1-yl)butyl)imidazolidine-2,4-dione::CHEMBL475724
SMILES: CCCOc1ccc2OCCC(=Nn3cc(O)n(CCCCN4CCCCC4)c3=O)c2c1
InChI Key: InChIKey=IEUWJEOYPCZDLZ-UHFFFAOYSA-N
Data: 2 IC50
Activity Spreadsheet -- Enzyme Inhibition Constant Data from BindingDB
Found 2 hits for monomerid = 50279740
Trg + Lig
Ki
nM
ΔG°
kcal/mole
IC50
nM
Kd
nM
EC50/IC50
nM
koff
s-1
kon
M-1s-1
pHTemp
°C
Potassium voltage-gated channel subfamily KQT member 1
(Cavia porcellus)
BDBM50279740
(1-(2,3-dihydro-6-propoxychromen-4-ylideneamino)-3-...)
Show SMILES CCCOc1ccc2OCCC(=Nn3cc(O)n(CCCCN4CCCCC4)c3=O)c2c1 |w:12.12|
Show InChI InChI=1S/C24H34N4O4/c1-2-15-31-19-8-9-22-20(17-19)21(10-16-32-22)25-28-18-23(29)27(24(28)30)14-7-6-13-26-11-4-3-5-12-26/h8-9,17-18,29H,2-7,10-16H2,1H3
n/an/a 3.20n/an/an/an/an/an/a
China Pharmaceutical University
Curated by ChEMBL
Assay Description
Inhibition of KVLQT1/minK in guinea pig ventricular myocytes assessed as blockade of slow delayed rectifier potassium current by whole cell patch-cla...
Bioorg Med Chem Lett 19: 1477-80 (2009)
Article DOI: 10.1016/j.bmcl.2009.01.022
BindingDB Entry DOI: 10.7270/Q22J6BQK
Potassium voltage-gated channel subfamily H member 2
(Cavia porcellus)
BDBM50279740
(1-(2,3-dihydro-6-propoxychromen-4-ylideneamino)-3-...)
Show SMILES CCCOc1ccc2OCCC(=Nn3cc(O)n(CCCCN4CCCCC4)c3=O)c2c1 |w:12.12|
Show InChI InChI=1S/C24H34N4O4/c1-2-15-31-19-8-9-22-20(17-19)21(10-16-32-22)25-28-18-23(29)27(24(28)30)14-7-6-13-26-11-4-3-5-12-26/h8-9,17-18,29H,2-7,10-16H2,1H3
n/an/a 400n/an/an/an/an/an/a
China Pharmaceutical University
Curated by ChEMBL
Assay Description
Inhibition of ERG in guinea pig ventricular myocytes assessed as blockade of rapid delayed rectifier potassium current by whole cell patch-clamp tech...
Bioorg Med Chem Lett 19: 1477-80 (2009)
Article DOI: 10.1016/j.bmcl.2009.01.022
BindingDB Entry DOI: 10.7270/Q22J6BQK