null
SMILES: NC(=O)[C@H](Cc1ccccc1)NP([O-])(=O)C(Cc1ccccc1)NC(=O)C(F)(F)F
InChI Key: InChIKey=RTBALMSTNAERMH-VYRBHSGPSA-M
Activity Spreadsheet -- Enzyme Inhibition Constant Data from BindingDB
Found 2 hits for monomerid = 50279831
Trg + Lig
Ki
nM
ΔG°
kcal/mole
IC50
nM
Kd
nM
EC50/IC50
nM
koff
s-1
kon
M-1s-1
pHTemp
°C
Gag-Pol polyprotein [489-587]
(Human immunodeficiency virus type 1)
BDBM50279831
(N-[(1S)-2-amino-1-benzyl-2-oxoethyl]-P-{2-phenyl-1...)
Show SMILES NC(=O)[C@H](Cc1ccccc1)NP([O-])(=O)C(Cc1ccccc1)NC(=O)C(F)(F)F
Show InChI InChI=1S/C19H21F3N3O4P/c20-19(21,22)18(27)24-16(12-14-9-5-2-6-10-14)30(28,29)25-15(17(23)26)11-13-7-3-1-4-8-13/h1-10,15-16H,11-12H2,(H2,23,26)(H,24,27)(H2,25,28,29)/p-1/t15-,16?/m0/s1
4.50E+4n/an/an/an/an/an/an/an/a
TBA
Curated by ChEMBL
Assay Description
Compound was evaluated for its binding affinity against HIV-1 protease
Bioorg Med Chem Lett 1: 653-658 (1991)
Article DOI: 10.1016/S0960-894X(01)81171-9
BindingDB Entry DOI: 10.7270/Q2BP038F
Gag-Pol polyprotein [489-587]
(Human immunodeficiency virus type 1)
BDBM50279831
(N-[(1S)-2-amino-1-benzyl-2-oxoethyl]-P-{2-phenyl-1...)
Show SMILES NC(=O)[C@H](Cc1ccccc1)NP([O-])(=O)C(Cc1ccccc1)NC(=O)C(F)(F)F
Show InChI InChI=1S/C19H21F3N3O4P/c20-19(21,22)18(27)24-16(12-14-9-5-2-6-10-14)30(28,29)25-15(17(23)26)11-13-7-3-1-4-8-13/h1-10,15-16H,11-12H2,(H2,23,26)(H,24,27)(H2,25,28,29)/p-1/t15-,16?/m0/s1
n/an/a 1.05E+5n/an/an/an/an/an/a
TBA
Curated by ChEMBL
Assay Description
Compound was evaluated for its binding affinity against HIV-1 protease
Bioorg Med Chem Lett 1: 653-658 (1991)
Article DOI: 10.1016/S0960-894X(01)81171-9
BindingDB Entry DOI: 10.7270/Q2BP038F