BDBM50280066 (Z)-6-{(2S,4S,5R)-2-[1-Methyl-1-(4-methyl-2-nitro-phenoxy)-ethyl]-4-pyridin-3-yl-[1,3]dioxan-5-yl}-hex-4-enoic acid::CHEMBL279847
SMILES: Cc1ccc(OC(C)(C)[C@H]2OC[C@@H](C\C=C/CCC(O)=O)[C@H](O2)c2cccnc2)c(c1)[N+]([O-])=O
InChI Key: InChIKey=VGBBXLWOWUXXFE-GWLGBLMRSA-N
Data: 2 IC50
Activity Spreadsheet -- Enzyme Inhibition Constant Data from BindingDB
Found 2 hits for monomerid = 50280066
Trg + Lig
Ki
nM
ΔG°
kcal/mole
IC50
nM
Kd
nM
EC50/IC50
nM
koff
s-1
kon
M-1s-1
pHTemp
°C
Bile salt export pump
(Homo sapiens (Human))
BDBM50280066
((Z)-6-{(2S,4S,5R)-2-[1-Methyl-1-(4-methyl-2-nitro-...)
Show SMILES Cc1ccc(OC(C)(C)[C@H]2OC[C@@H](C\C=C/CCC(O)=O)[C@H](O2)c2cccnc2)c(c1)[N+]([O-])=O
Show InChI InChI=1S/C25H30N2O7/c1-17-11-12-21(20(14-17)27(30)31)34-25(2,3)24-32-16-19(8-5-4-6-10-22(28)29)23(33-24)18-9-7-13-26-15-18/h4-5,7,9,11-15,19,23-24H,6,8,10,16H2,1-3H3,(H,28,29)/b5-4-/t19-,23-,24+/m1/s1
n/an/a<1.00E+4n/an/an/an/an/an/a
AstraZeneca
Curated by ChEMBL
Assay Description
Inhibition of human BSEP expressed in baculovirus transfected fall armyworm Sf21 cell membranes vesicles assessed as reduction in ATP-dependent [3H]-...
Drug Metab Dispos 40: 2332-41 (2012)
Article DOI: 10.1124/dmd.112.047068
BindingDB Entry DOI: 10.7270/Q2ZP488M
Thromboxane A2 Synthase (P450 TxA2)
(Homo sapiens (Human))
BDBM50280066
((Z)-6-{(2S,4S,5R)-2-[1-Methyl-1-(4-methyl-2-nitro-...)
Show SMILES Cc1ccc(OC(C)(C)[C@H]2OC[C@@H](C\C=C/CCC(O)=O)[C@H](O2)c2cccnc2)c(c1)[N+]([O-])=O
Show InChI InChI=1S/C25H30N2O7/c1-17-11-12-21(20(14-17)27(30)31)34-25(2,3)24-32-16-19(8-5-4-6-10-22(28)29)23(33-24)18-9-7-13-26-15-18/h4-5,7,9,11-15,19,23-24H,6,8,10,16H2,1-3H3,(H,28,29)/b5-4-/t19-,23-,24+/m1/s1
n/an/a 19n/an/an/an/an/an/a
TBA
Curated by ChEMBL
Assay Description
Inhibition of human Thromboxane A2 synthase
Bioorg Med Chem Lett 2: 1181-1186 (1992)
Article DOI: 10.1016/S0960-894X(00)80210-3
BindingDB Entry DOI: 10.7270/Q2SJ1KHD