BDBM50280240 (3R,4S,5R)-4-hydroxy-5-[(1S)-1-methyl-2-oxido-2-oxo-1-phosphonatoethoxy]-3-(phosphonatooxy)cyclohex-1-ene-1-carboxylate
SMILES: C[C@@](O[C@@H]1CC(=C[C@@H](OP([O-])([O-])=O)[C@H]1O)C([O-])=O)(C([O-])=O)P([O-])([O-])=O
InChI Key: InChIKey=HUOJJMMXOWLGJU-JQCUSGDOSA-H
Data: 1 KI  1 Kd
PDB links: 1 PDB ID matches this monomer.
Activity Spreadsheet -- Enzyme Inhibition Constant Data from BindingDB
Found 2 hits for monomerid = 50280240
Trg + Lig
Ki
nM
ΔG°
kcal/mole
IC50
nM
Kd
nM
EC50/IC50
nM
koff
s-1
kon
M-1s-1
pHTemp
°C
5-enolpyruvylshikimate-3-phosphate synthase
(Escherichia coli (strain K12))
BDBM50280240
((3R,4S,5R)-4-hydroxy-5-[(1S)-1-methyl-2-oxido-2-ox...)
Show SMILES C[C@@](O[C@@H]1CC(=C[C@@H](OP([O-])([O-])=O)[C@H]1O)C([O-])=O)(C([O-])=O)P([O-])([O-])=O |c:5|
Show InChI InChI=1S/C10H16O13P2/c1-10(9(14)15,24(16,17)18)22-5-2-4(8(12)13)3-6(7(5)11)23-25(19,20)21/h3,5-7,11H,2H2,1H3,(H,12,13)(H,14,15)(H2,16,17,18)(H2,19,20,21)/p-6/t5-,6-,7+,10+/m1/s1
15n/an/an/an/an/an/an/an/a
TBA
Curated by ChEMBL
Assay Description
Potency against EPSP synthase
Bioorg Med Chem Lett 2: 1435-1440 (1992)
Article DOI: 10.1016/S0960-894X(00)80527-2
BindingDB Entry DOI: 10.7270/Q2XD1244
3D
3D Structure (crystal)
5-enolpyruvylshikimate-3-phosphate synthase
(Escherichia coli (strain K12))
BDBM50280240
((3R,4S,5R)-4-hydroxy-5-[(1S)-1-methyl-2-oxido-2-ox...)
Show SMILES C[C@@](O[C@@H]1CC(=C[C@@H](OP([O-])([O-])=O)[C@H]1O)C([O-])=O)(C([O-])=O)P([O-])([O-])=O |c:5|
Show InChI InChI=1S/C10H16O13P2/c1-10(9(14)15,24(16,17)18)22-5-2-4(8(12)13)3-6(7(5)11)23-25(19,20)21/h3,5-7,11H,2H2,1H3,(H,12,13)(H,14,15)(H2,16,17,18)(H2,19,20,21)/p-6/t5-,6-,7+,10+/m1/s1
n/an/an/a 15n/an/an/an/an/a
TBA
Curated by ChEMBL
Assay Description
Dissociation constant against EPSP synthase
Bioorg Med Chem Lett 2: 1435-1440 (1992)
Article DOI: 10.1016/S0960-894X(00)80527-2
BindingDB Entry DOI: 10.7270/Q2XD1244
3D
3D Structure (crystal)