BDBM50280320 CHEMBL51084::[4-Oxo-3-[2'-(1H-tetrazol-5-yl)-biphenyl-4-ylmethyl]-3-aza-spiro[5.5]undec-(2E)-ylidene]-acetic acid ethyl ester
SMILES: CCOC(=O)\C=C1/CC2(CCCCC2)CC(=O)N1Cc1ccc(cc1)-c1ccccc1-c1nnn[nH]1
InChI Key: InChIKey=PMSCRPPKOPHHFJ-CJLVFECKSA-N
Data: 1 IC50  1 Kd
Activity Spreadsheet -- Enzyme Inhibition Constant Data from BindingDB
Found 2 hits for monomerid = 50280320
Trg + Lig
Ki
nM
ΔG°
kcal/mole
IC50
nM
Kd
nM
EC50/IC50
nM
koff
s-1
kon
M-1s-1
pHTemp
°C
Angiotensin II type 1a (AT-1a) receptor
(RABBIT)
BDBM50280320
(CHEMBL51084 | [4-Oxo-3-[2'-(1H-tetrazol-5-yl)-biph...)
Show SMILES CCOC(=O)\C=C1/CC2(CCCCC2)CC(=O)N1Cc1ccc(cc1)-c1ccccc1-c1nnn[nH]1
Show InChI InChI=1S/C28H31N5O3/c1-2-36-26(35)16-22-17-28(14-6-3-7-15-28)18-25(34)33(22)19-20-10-12-21(13-11-20)23-8-4-5-9-24(23)27-29-31-32-30-27/h4-5,8-13,16H,2-3,6-7,14-15,17-19H2,1H3,(H,29,30,31,32)/b22-16+
n/an/an/a 5.01n/an/an/an/an/a
TBA
Curated by ChEMBL
Assay Description
In vitro binding affinity against Angiotensin II receptor in rabbit aorta rings
Bioorg Med Chem Lett 4: 87-92 (1994)
Article DOI: 10.1016/S0960-894X(01)81127-6
BindingDB Entry DOI: 10.7270/Q2BC40QF
Angiotensin II type 1a (AT-1a) receptor
(Bos taurus)
BDBM50280320
(CHEMBL51084 | [4-Oxo-3-[2'-(1H-tetrazol-5-yl)-biph...)
Show SMILES CCOC(=O)\C=C1/CC2(CCCCC2)CC(=O)N1Cc1ccc(cc1)-c1ccccc1-c1nnn[nH]1
Show InChI InChI=1S/C28H31N5O3/c1-2-36-26(35)16-22-17-28(14-6-3-7-15-28)18-25(34)33(22)19-20-10-12-21(13-11-20)23-8-4-5-9-24(23)27-29-31-32-30-27/h4-5,8-13,16H,2-3,6-7,14-15,17-19H2,1H3,(H,29,30,31,32)/b22-16+
Reactome pathway
n/an/a 40n/an/an/an/an/an/a
TBA
Curated by ChEMBL
Assay Description
Ability of the compound to displace [125I]- labelled [Sar1,Ileu8] from angiotensin II receptor of bovine adrenal cortex membranes
Bioorg Med Chem Lett 2: 1775-1779 (1992)
Article DOI: 10.1016/S0960-894X(00)80474-6
BindingDB Entry DOI: 10.7270/Q2NP24B9