BDBM50280327 CHEMBL295369::[6-Oxo-4,4-dipropyl-1-[2'-(1H-tetrazol-5-yl)-biphenyl-4-ylmethyl]-piperidin-(2E)-ylidene]-acetic acid ethyl ester
SMILES: CCCC1(CCC)CC(=O)N(Cc2ccc(cc2)-c2ccccc2-c2nnn[nH]2)\C(C1)=C\C(=O)OCC
InChI Key: InChIKey=WWJXFJIRUDOMQA-HAVVHWLPSA-N
Data: 1 IC50
Activity Spreadsheet -- Enzyme Inhibition Constant Data from BindingDB
Found 1 hit for monomerid = 50280327
Trg + Lig
Ki
nM
ΔG°
kcal/mole
IC50
nM
Kd
nM
EC50/IC50
nM
koff
s-1
kon
M-1s-1
pHTemp
°C
Type-1 angiotensin II receptor
(Bos taurus)
BDBM50280327
(CHEMBL295369 | [6-Oxo-4,4-dipropyl-1-[2'-(1H-tetra...)
Show SMILES CCCC1(CCC)CC(=O)N(Cc2ccc(cc2)-c2ccccc2-c2nnn[nH]2)\C(C1)=C\C(=O)OCC
Show InChI InChI=1S/C29H35N5O3/c1-4-15-29(16-5-2)18-23(17-27(36)37-6-3)34(26(35)19-29)20-21-11-13-22(14-12-21)24-9-7-8-10-25(24)28-30-32-33-31-28/h7-14,17H,4-6,15-16,18-20H2,1-3H3,(H,30,31,32,33)/b23-17+
Reactome pathway
n/an/a 330n/an/an/an/an/an/a
TBA
Curated by ChEMBL
Assay Description
Ability of the compound to displace [125I]- labelled [Sar1,Ileu8] from angiotensin II receptor of bovine adrenal cortex membranes
Bioorg Med Chem Lett 2: 1775-1779 (1992)
Article DOI: 10.1016/S0960-894X(00)80474-6
BindingDB Entry DOI: 10.7270/Q2NP24B9