BDBM50280329 CHEMBL50906::[4-Methyl-6-oxo-4-propyl-1-[2'-(1H-tetrazol-5-yl)-biphenyl-4-ylmethyl]-piperidin-(2E)-ylidene]-acetic acid ethyl ester
SMILES: CCCC1(C)CC(=O)N(Cc2ccc(cc2)-c2ccccc2-c2nnn[nH]2)\C(C1)=C\C(=O)OCC
InChI Key: InChIKey=VDMSVIJAKNJILQ-RCCKNPSSSA-N
Data: 1 IC50
Activity Spreadsheet -- Enzyme Inhibition Constant Data from BindingDB
Found 1 hit for monomerid = 50280329
Trg + Lig
Ki
nM
ΔG°
kcal/mole
IC50
nM
Kd
nM
EC50/IC50
nM
koff
s-1
kon
M-1s-1
pHTemp
°C
Type-1 angiotensin II receptor
(Bos taurus)
BDBM50280329
(CHEMBL50906 | [4-Methyl-6-oxo-4-propyl-1-[2'-(1H-t...)
Show SMILES CCCC1(C)CC(=O)N(Cc2ccc(cc2)-c2ccccc2-c2nnn[nH]2)\C(C1)=C\C(=O)OCC
Show InChI InChI=1S/C27H31N5O3/c1-4-14-27(3)16-21(15-25(34)35-5-2)32(24(33)17-27)18-19-10-12-20(13-11-19)22-8-6-7-9-23(22)26-28-30-31-29-26/h6-13,15H,4-5,14,16-18H2,1-3H3,(H,28,29,30,31)/b21-15+
Reactome pathway
n/an/a 120n/an/an/an/an/an/a
TBA
Curated by ChEMBL
Assay Description
Ability of the compound to displace [125I]- labelled [Sar1,Ileu8] from angiotensin II receptor of bovine adrenal cortex membranes
Bioorg Med Chem Lett 2: 1775-1779 (1992)
Article DOI: 10.1016/S0960-894X(00)80474-6
BindingDB Entry DOI: 10.7270/Q2NP24B9