BDBM50280425 1-(4-Azido-phenyl)-2-imidazol-1-yl-ethanone::CHEMBL339057
SMILES: [N-]=[N+]=Nc1ccc(cc1)C(=O)Cn1ccnc1
InChI Key: InChIKey=ASANKGQBNYJXNA-UHFFFAOYSA-N
Data: 1 Kd
Activity Spreadsheet -- Enzyme Inhibition Constant Data from BindingDB
Found 1 hit for monomerid = 50280425
Trg + Lig
Ki
nM
ΔG°
kcal/mole
IC50
nM
Kd
nM
EC50/IC50
nM
koff
s-1
kon
M-1s-1
pHTemp
°C
Sterol 14α-demethylase (CYP51)
(Homo sapiens (Human))
BDBM50280425
(1-(4-Azido-phenyl)-2-imidazol-1-yl-ethanone | CHEM...)
Show SMILES [N-]=[N+]=Nc1ccc(cc1)C(=O)Cn1ccnc1
Show InChI InChI=1S/C11H9N5O/c12-15-14-10-3-1-9(2-4-10)11(17)7-16-6-5-13-8-16/h1-6,8H,7H2
n/an/an/a 1.80E+4n/an/an/an/an/a
TBA
Curated by ChEMBL
Assay Description
Binding affinity for cytochrome P450 14DM
Bioorg Med Chem Lett 2: 383-386 (1992)
Article DOI: 10.1016/S0960-894X(00)80151-1
BindingDB Entry DOI: 10.7270/Q2GX4BFR