BDBM50280476 (2R,6aS,12aS)-2-Isopropyl-8,9-dimethoxy-6a-methyl-1,2,12,12a-tetrahydro-6aH-chromeno[3,4-b]furo[2,3-h]chromen-6-one::CHEMBL154388
SMILES: COc1cc2OC[C@H]3Oc4c5C[C@@H](Oc5ccc4C(=O)[C@@]3(C)c2cc1OC)C(C)C
InChI Key: InChIKey=LHVZXPIPXSDPAX-JKHABCDFSA-N
Data: 1 IC50
Activity Spreadsheet -- Enzyme Inhibition Constant Data from BindingDB
Found 1 hit for monomerid = 50280476
Trg + Lig
Ki
nM
ΔG°
kcal/mole
IC50
nM
Kd
nM
EC50/IC50
nM
koff
s-1
kon
M-1s-1
pHTemp
°C
Mitochondrial complex I (NADH dehydrogenase)
(Homo sapiens (Human))
BDBM50280476
((2R,6aS,12aS)-2-Isopropyl-8,9-dimethoxy-6a-methyl-...)
Show SMILES COc1cc2OC[C@H]3Oc4c5C[C@@H](Oc5ccc4C(=O)[C@@]3(C)c2cc1OC)C(C)C
Show InChI InChI=1S/C24H26O6/c1-12(2)17-8-14-16(29-17)7-6-13-22(14)30-21-11-28-18-10-20(27-5)19(26-4)9-15(18)24(21,3)23(13)25/h6-7,9-10,12,17,21H,8,11H2,1-5H3/t17-,21-,24+/m1/s1
Reactome pathway
n/an/a 16n/an/an/an/an/an/a
TBA
Curated by ChEMBL
Assay Description
The compound was evaluated for the inhibition of NADH dehydrogenase
Bioorg Med Chem Lett 2: 593-596 (1992)
Article DOI: 10.1016/S0960-894X(01)81204-X
BindingDB Entry DOI: 10.7270/Q2H70G9H