BDBM50280657 3-Dimethylcarbamoyloxy-benzo[4,5]thieno[3,2-b]furan-2-carboxylic acid methyl ester::CHEMBL268459
SMILES: COC(=O)c1oc2c(sc3ccccc23)c1OC(=O)N(C)C
InChI Key: InChIKey=OWVLGIHMRGXJOF-UHFFFAOYSA-N
Data: 1 IC50
Activity Spreadsheet -- Enzyme Inhibition Constant Data from BindingDB
Found 1 hit for monomerid = 50280657
Trg + Lig
Ki
nM
ΔG°
kcal/mole
IC50
nM
Kd
nM
EC50/IC50
nM
koff
s-1
kon
M-1s-1
pHTemp
°C
Thrombin
(Bos taurus (Bovine))
BDBM50280657
(3-Dimethylcarbamoyloxy-benzo[4,5]thieno[3,2-b]fura...)
Show SMILES COC(=O)c1oc2c(sc3ccccc23)c1OC(=O)N(C)C
Show InChI InChI=1S/C15H13NO5S/c1-16(2)15(18)21-11-12(14(17)19-3)20-10-8-6-4-5-7-9(8)22-13(10)11/h4-7H,1-3H3
n/an/a>1.00E+4n/an/an/an/an/an/a
TBA
Curated by ChEMBL
Assay Description
In vitro concentration of compound required to inhibit 50% of 6 nM thrombin
Bioorg Med Chem Lett 2: 1025-1028 (1992)
Article DOI: 10.1016/S0960-894X(00)80611-3
BindingDB Entry DOI: 10.7270/Q2X066XV