BDBM50280694 CHEMBL15292::Sodium; 3-[1-[3-(7-chloro-quinolin-2-ylmethoxy)-phenyl]-3-(2-sulfamoyl-phenyl)-propylsulfanyl]-propionate
SMILES: NS(=O)(=O)c1ccccc1CCC(SCCC([O-])=O)c1cccc(OCc2ccc3ccc(Cl)cc3n2)c1
InChI Key: InChIKey=NWKACWASVNUIPU-UHFFFAOYSA-M
Data: 2 IC50
Activity Spreadsheet -- Enzyme Inhibition Constant Data from BindingDB
Found 2 hits for monomerid = 50280694
Trg + Lig
Ki
nM
ΔG°
kcal/mole
IC50
nM
Kd
nM
EC50/IC50
nM
koff
s-1
kon
M-1s-1
pHTemp
°C
Cysteinyl leukotriene receptor 1
(GUINEA PIG)
BDBM50280694
(CHEMBL15292 | Sodium; 3-[1-[3-(7-chloro-quinolin-2...)
Show SMILES NS(=O)(=O)c1ccccc1CCC(SCCC([O-])=O)c1cccc(OCc2ccc3ccc(Cl)cc3n2)c1
Show InChI InChI=1S/C28H27ClN2O5S2/c29-22-11-8-19-9-12-23(31-25(19)17-22)18-36-24-6-3-5-21(16-24)26(37-15-14-28(32)33)13-10-20-4-1-2-7-27(20)38(30,34)35/h1-9,11-12,16-17,26H,10,13-15,18H2,(H,32,33)(H2,30,34,35)/p-1
n/an/a 0.600n/an/an/an/an/an/a
TBA
Curated by ChEMBL
Assay Description
Inhibitory concentration against [3H]-Leukotriene D4 binding to guinea-pig lung membranes was determined; experiment 2
Bioorg Med Chem Lett 2: 1141-1146 (1992)
Article DOI: 10.1016/S0960-894X(00)80635-6
BindingDB Entry DOI: 10.7270/Q2D21XJR
Cysteinyl leukotriene receptor 1
(GUINEA PIG)
BDBM50280694
(CHEMBL15292 | Sodium; 3-[1-[3-(7-chloro-quinolin-2...)
Show SMILES NS(=O)(=O)c1ccccc1CCC(SCCC([O-])=O)c1cccc(OCc2ccc3ccc(Cl)cc3n2)c1
Show InChI InChI=1S/C28H27ClN2O5S2/c29-22-11-8-19-9-12-23(31-25(19)17-22)18-36-24-6-3-5-21(16-24)26(37-15-14-28(32)33)13-10-20-4-1-2-7-27(20)38(30,34)35/h1-9,11-12,16-17,26H,10,13-15,18H2,(H,32,33)(H2,30,34,35)/p-1
n/an/a 0.400n/an/an/an/an/an/a
TBA
Curated by ChEMBL
Assay Description
Inhibitory concentration against [3H]-Leukotriene D4 binding to guinea-pig lung membranes was determined; experiment 2
Bioorg Med Chem Lett 2: 1141-1146 (1992)
Article DOI: 10.1016/S0960-894X(00)80635-6
BindingDB Entry DOI: 10.7270/Q2D21XJR