BDBM50280827 1'-{2-[4-(5-fluoro-1H-3-indolylmethyl)hexahydro-1-pyridinyl]ethyl}spiro[cyclopropane-1,3'-(2',3'-dihydro-1'H-indole)]-2'-one::CHEMBL61256
SMILES: Fc1ccc2[nH]cc(CC3CCN(CCN4C(=O)C5(CC5)c5ccccc45)CC3)c2c1
InChI Key: InChIKey=ZLKQAALBMPFYRJ-UHFFFAOYSA-N
Data: 4 IC50
Activity Spreadsheet -- Enzyme Inhibition Constant Data from BindingDB
Found 4 hits for monomerid = 50280827
Trg + Lig
Ki
nM
ΔG°
kcal/mole
IC50
nM
Kd
nM
EC50/IC50
nM
koff
s-1
kon
M-1s-1
pHTemp
°C
D(2) dopamine receptor
(Mus musculus (Mouse))
BDBM50280827
(1'-{2-[4-(5-fluoro-1H-3-indolylmethyl)hexahydro-1-...)
Show SMILES Fc1ccc2[nH]cc(CC3CCN(CCN4C(=O)C5(CC5)c5ccccc45)CC3)c2c1
Show InChI InChI=1S/C26H28FN3O/c27-20-5-6-23-21(16-20)19(17-28-23)15-18-7-11-29(12-8-18)13-14-30-24-4-2-1-3-22(24)26(9-10-26)25(30)31/h1-6,16-18,28H,7-15H2
n/an/a>100n/an/an/an/an/an/a
TBA
Curated by ChEMBL
Assay Description
Tested for its binding affinity against Dopamine receptor D2; showed no appreciable affinity at concentration specified
Bioorg Med Chem Lett 3: 1913-1918 (1993)
Article DOI: 10.1016/S0960-894X(01)80986-0
BindingDB Entry DOI: 10.7270/Q27944M4
Muscarinic acetylcholine receptor
(Homo sapiens (Human))
BDBM50280827
(1'-{2-[4-(5-fluoro-1H-3-indolylmethyl)hexahydro-1-...)
Show SMILES Fc1ccc2[nH]cc(CC3CCN(CCN4C(=O)C5(CC5)c5ccccc45)CC3)c2c1
Show InChI InChI=1S/C26H28FN3O/c27-20-5-6-23-21(16-20)19(17-28-23)15-18-7-11-29(12-8-18)13-14-30-24-4-2-1-3-22(24)26(9-10-26)25(30)31/h1-6,16-18,28H,7-15H2
NCI pathway
Reactome pathway
n/an/a>100n/an/an/an/an/an/a
TBA
Curated by ChEMBL
Assay Description
Tested for its binding affinity against muscarinic receptor; showed no appreciable affinity at concentration specified
Bioorg Med Chem Lett 3: 1913-1918 (1993)
Article DOI: 10.1016/S0960-894X(01)80986-0
BindingDB Entry DOI: 10.7270/Q27944M4
Alpha-1 adrenergic receptor
(Mus musculus (Mouse))
BDBM50280827
(1'-{2-[4-(5-fluoro-1H-3-indolylmethyl)hexahydro-1-...)
Show SMILES Fc1ccc2[nH]cc(CC3CCN(CCN4C(=O)C5(CC5)c5ccccc45)CC3)c2c1
Show InChI InChI=1S/C26H28FN3O/c27-20-5-6-23-21(16-20)19(17-28-23)15-18-7-11-29(12-8-18)13-14-30-24-4-2-1-3-22(24)26(9-10-26)25(30)31/h1-6,16-18,28H,7-15H2
n/an/a>100n/an/an/an/an/an/a
TBA
Curated by ChEMBL
Assay Description
Tested for its binding affinity against Alpha-1 adrenergic receptor; showed no appreciable affinity at concentration specified
Bioorg Med Chem Lett 3: 1913-1918 (1993)
Article DOI: 10.1016/S0960-894X(01)80986-0
BindingDB Entry DOI: 10.7270/Q27944M4
Serotonin 1 (5-HT1) receptor
(RAT-Rattus norvegicus (rat)-Rattus norvegicus (Rat...)
BDBM50280827
(1'-{2-[4-(5-fluoro-1H-3-indolylmethyl)hexahydro-1-...)
Show SMILES Fc1ccc2[nH]cc(CC3CCN(CCN4C(=O)C5(CC5)c5ccccc45)CC3)c2c1
Show InChI InChI=1S/C26H28FN3O/c27-20-5-6-23-21(16-20)19(17-28-23)15-18-7-11-29(12-8-18)13-14-30-24-4-2-1-3-22(24)26(9-10-26)25(30)31/h1-6,16-18,28H,7-15H2
n/an/a 4n/an/an/an/an/an/a
TBA
Curated by ChEMBL
Assay Description
Compound was evaluated for inhibition of 5-HT uptake by measuring its ability to inhibit [3H]paroxetine binding to rat cortical membranes
Bioorg Med Chem Lett 3: 1913-1918 (1993)
Article DOI: 10.1016/S0960-894X(01)80986-0
BindingDB Entry DOI: 10.7270/Q27944M4