null
SMILES: CCc1cc(C(C)=O)c([O-])cc1OCCCOc1ccc(cc1CCC([O-])=O)C(=O)c1cccc(c1)C([O-])=O
InChI Key: InChIKey=VJOOLOSOHRTZBG-UHFFFAOYSA-K
Activity Spreadsheet -- Enzyme Inhibition Constant Data from BindingDB
Found 2 hits for monomerid = 50280886
Trg + Lig
Ki
nM
ΔG°
kcal/mole
IC50
nM
Kd
nM
EC50/IC50
nM
koff
s-1
kon
M-1s-1
pHTemp
°C
Leukotriene B4 receptor 1
(Homo sapiens (Human))
BDBM50280886
(3-[2-[3-(4-acetyl-2-ethyl-5-olatophenoxy)propoxy]-...)
Show SMILES CCc1cc(C(C)=O)c([O-])cc1OCCCOc1ccc(cc1CCC([O-])=O)C(=O)c1cccc(c1)C([O-])=O
Show InChI InChI=1S/C30H30O9/c1-3-19-16-24(18(2)31)25(32)17-27(19)39-13-5-12-38-26-10-8-22(14-20(26)9-11-28(33)34)29(35)21-6-4-7-23(15-21)30(36)37/h4,6-8,10,14-17,32H,3,5,9,11-13H2,1-2H3,(H,33,34)(H,36,37)/p-3
6.80n/an/an/an/an/an/an/an/a
TBA
Curated by ChEMBL
Assay Description
Compound was evaluated for inhibition of binding of [3H]LTB4 to LTB4 receptor in guinea-pig lung membranes
Bioorg Med Chem Lett 3: 1981-1984 (1993)
Article DOI: 10.1016/S0960-894X(01)80999-9
BindingDB Entry DOI: 10.7270/Q2VH5P9R
Leukotriene B4 receptor 1
(Homo sapiens (Human))
BDBM50280886
(3-[2-[3-(4-acetyl-2-ethyl-5-olatophenoxy)propoxy]-...)
Show SMILES CCc1cc(C(C)=O)c([O-])cc1OCCCOc1ccc(cc1CCC([O-])=O)C(=O)c1cccc(c1)C([O-])=O
Show InChI InChI=1S/C30H30O9/c1-3-19-16-24(18(2)31)25(32)17-27(19)39-13-5-12-38-26-10-8-22(14-20(26)9-11-28(33)34)29(35)21-6-4-7-23(15-21)30(36)37/h4,6-8,10,14-17,32H,3,5,9,11-13H2,1-2H3,(H,33,34)(H,36,37)/p-3
n/an/a 46n/an/an/an/an/an/a
TBA
Curated by ChEMBL
Assay Description
In vitro antagonistic activity towards LTB4 receptor was evaluated by inhibition of binding of [3H]LTB4 to human neutrophils
Bioorg Med Chem Lett 3: 1981-1984 (1993)
Article DOI: 10.1016/S0960-894X(01)80999-9
BindingDB Entry DOI: 10.7270/Q2VH5P9R