null
SMILES: CCOC(=O)\C=C1/N(Cc2ccc(cc2)-c2ccccc2-c2nnn[nH]2)C(=O)CC1(C)CC
InChI Key: InChIKey=GOVCKLDFCNZSSA-STZFKDTASA-N
Activity Spreadsheet -- Enzyme Inhibition Constant Data from BindingDB
Found 1 hit for monomerid = 50281520
Trg + Lig
Ki
nM
ΔG°
kcal/mole
IC50
nM
Kd
nM
EC50/IC50
nM
koff
s-1
kon
M-1s-1
pHTemp
°C
Type-1 angiotensin II receptor
(Bos taurus)
BDBM50281520
(CHEMBL123348 | [3-Ethyl-3-methyl-5-oxo-1-[2'-(1H-t...)
Show SMILES CCOC(=O)\C=C1/N(Cc2ccc(cc2)-c2ccccc2-c2nnn[nH]2)C(=O)CC1(C)CC
Show InChI InChI=1S/C25H27N5O3/c1-4-25(3)15-22(31)30(21(25)14-23(32)33-5-2)16-17-10-12-18(13-11-17)19-8-6-7-9-20(19)24-26-28-29-27-24/h6-14H,4-5,15-16H2,1-3H3,(H,26,27,28,29)/b21-14-
Reactome pathway
n/an/a 60n/an/an/an/an/an/a
TBA
Curated by ChEMBL
Assay Description
Concentration that gives 50% inhibition for binding of 125-I-[Sar1, IIe8] angiotensin to Angiotensin II receptor, type 1 in bovine adrenal cortex mem...
Bioorg Med Chem Lett 3: 369-374 (1993)
Article DOI: 10.1016/S0960-894X(01)80914-8
BindingDB Entry DOI: 10.7270/Q20G3K2H