BDBM50282466 CHEMBL354779::Quinazolinone Analog
SMILES: CCCCCOC(=O)NS(=O)(=O)c1ccccc1-c1ccc(Cn2c(CCCC)nc3ccc(NC(=O)NC(C)C)cc3c2=O)cc1
InChI Key: InChIKey=PQBGYMDWFDMSQB-UHFFFAOYSA-N
Data: 2 IC50
Activity Spreadsheet -- Enzyme Inhibition Constant Data from BindingDB
Found 2 hits for monomerid = 50282466
Trg + Lig
Ki
nM
ΔG°
kcal/mole
IC50
nM
Kd
nM
EC50/IC50
nM
koff
s-1
kon
M-1s-1
pHTemp
°C
Angiotensin II AT2
(RAT)
BDBM50282466
(CHEMBL354779 | Quinazolinone Analog)
Show SMILES CCCCCOC(=O)NS(=O)(=O)c1ccccc1-c1ccc(Cn2c(CCCC)nc3ccc(NC(=O)NC(C)C)cc3c2=O)cc1
Show InChI InChI=1S/C35H43N5O6S/c1-5-7-11-21-46-35(43)39-47(44,45)31-13-10-9-12-28(31)26-17-15-25(16-18-26)23-40-32(14-8-6-2)38-30-20-19-27(22-29(30)33(40)41)37-34(42)36-24(3)4/h9-10,12-13,15-20,22,24H,5-8,11,14,21,23H2,1-4H3,(H,39,43)(H2,36,37,42)
n/an/a 2.90n/an/an/an/an/an/a
TBA
Curated by ChEMBL
Assay Description
In vitro for binding affinity against angiotensin II receptor type 2 in rat midbrain membrane
Bioorg Med Chem Lett 4: 81-86 (1994)
Article DOI: 10.1016/S0960-894X(01)81126-4
BindingDB Entry DOI: 10.7270/Q2D79BBS
Angiotensin II type 1a (AT-1a) receptor
(RABBIT)
BDBM50282466
(CHEMBL354779 | Quinazolinone Analog)
Show SMILES CCCCCOC(=O)NS(=O)(=O)c1ccccc1-c1ccc(Cn2c(CCCC)nc3ccc(NC(=O)NC(C)C)cc3c2=O)cc1
Show InChI InChI=1S/C35H43N5O6S/c1-5-7-11-21-46-35(43)39-47(44,45)31-13-10-9-12-28(31)26-17-15-25(16-18-26)23-40-32(14-8-6-2)38-30-20-19-27(22-29(30)33(40)41)37-34(42)36-24(3)4/h9-10,12-13,15-20,22,24H,5-8,11,14,21,23H2,1-4H3,(H,39,43)(H2,36,37,42)
n/an/a 0.170n/an/an/an/an/an/a
TBA
Curated by ChEMBL
Assay Description
Tested in vitro for binding affinity against Angiotensin II receptor, type 1 in rabbit aortic membrane
Bioorg Med Chem Lett 4: 81-86 (1994)
Article DOI: 10.1016/S0960-894X(01)81126-4
BindingDB Entry DOI: 10.7270/Q2D79BBS