BDBM50282470 CHEMBL353037::Quinazolinone Analog
SMILES: CCCCOC(=O)NS(=O)(=O)c1ccccc1-c1ccc(Cn2c(CCC)nc3ccc(NC(=O)NC(C)C)cc3c2=O)cc1
InChI Key: InChIKey=JMHJWBAIAMVOJF-UHFFFAOYSA-N
Data: 2 IC50
Activity Spreadsheet -- Enzyme Inhibition Constant Data from BindingDB
Found 2 hits for monomerid = 50282470
Trg + Lig
Ki
nM
ΔG°
kcal/mole
IC50
nM
Kd
nM
EC50/IC50
nM
koff
s-1
kon
M-1s-1
pHTemp
°C
Angiotensin II AT2
(RAT)
BDBM50282470
(CHEMBL353037 | Quinazolinone Analog)
Show SMILES CCCCOC(=O)NS(=O)(=O)c1ccccc1-c1ccc(Cn2c(CCC)nc3ccc(NC(=O)NC(C)C)cc3c2=O)cc1
Show InChI InChI=1S/C33H39N5O6S/c1-5-7-19-44-33(41)37-45(42,43)29-12-9-8-11-26(29)24-15-13-23(14-16-24)21-38-30(10-6-2)36-28-18-17-25(20-27(28)31(38)39)35-32(40)34-22(3)4/h8-9,11-18,20,22H,5-7,10,19,21H2,1-4H3,(H,37,41)(H2,34,35,40)
n/an/a 3.60n/an/an/an/an/an/a
TBA
Curated by ChEMBL
Assay Description
In vitro for binding affinity against angiotensin II receptor type 2 in rat midbrain membrane
Bioorg Med Chem Lett 4: 81-86 (1994)
Article DOI: 10.1016/S0960-894X(01)81126-4
BindingDB Entry DOI: 10.7270/Q2D79BBS
Angiotensin II type 1a (AT-1a) receptor
(RABBIT)
BDBM50282470
(CHEMBL353037 | Quinazolinone Analog)
Show SMILES CCCCOC(=O)NS(=O)(=O)c1ccccc1-c1ccc(Cn2c(CCC)nc3ccc(NC(=O)NC(C)C)cc3c2=O)cc1
Show InChI InChI=1S/C33H39N5O6S/c1-5-7-19-44-33(41)37-45(42,43)29-12-9-8-11-26(29)24-15-13-23(14-16-24)21-38-30(10-6-2)36-28-18-17-25(20-27(28)31(38)39)35-32(40)34-22(3)4/h8-9,11-18,20,22H,5-7,10,19,21H2,1-4H3,(H,37,41)(H2,34,35,40)
n/an/a 0.120n/an/an/an/an/an/a
TBA
Curated by ChEMBL
Assay Description
Tested in vitro for binding affinity against Angiotensin II receptor, type 1 in rabbit aortic membrane
Bioorg Med Chem Lett 4: 81-86 (1994)
Article DOI: 10.1016/S0960-894X(01)81126-4
BindingDB Entry DOI: 10.7270/Q2D79BBS