BDBM50282708 CHEMBL289472::Thiophene-2-carboxylic acid benzyl-{2-ethyl-4-oxo-3-[2'-(1H-tetrazol-5-yl)-biphenyl-4-ylmethyl]-3,4-dihydro-quinazolin-6-yl}-amide
SMILES: CCc1nc2ccc(cc2c(=O)n1Cc1ccc(cc1)-c1ccccc1-c1nnn[nH]1)N(Cc1ccccc1)C(=O)c1cccs1
InChI Key: InChIKey=KDPHUUTUDFDLBT-UHFFFAOYSA-N
Data: 2 IC50
Activity Spreadsheet -- Enzyme Inhibition Constant Data from BindingDB
Found 2 hits for monomerid = 50282708
Trg + Lig
Ki
nM
ΔG°
kcal/mole
IC50
nM
Kd
nM
EC50/IC50
nM
koff
s-1
kon
M-1s-1
pHTemp
°C
Angiotensin II AT2
(RAT)
BDBM50282708
(CHEMBL289472 | Thiophene-2-carboxylic acid benzyl-...)
Show SMILES CCc1nc2ccc(cc2c(=O)n1Cc1ccc(cc1)-c1ccccc1-c1nnn[nH]1)N(Cc1ccccc1)C(=O)c1cccs1
Show InChI InChI=1S/C36H29N7O2S/c1-2-33-37-31-19-18-27(42(22-24-9-4-3-5-10-24)36(45)32-13-8-20-46-32)21-30(31)35(44)43(33)23-25-14-16-26(17-15-25)28-11-6-7-12-29(28)34-38-40-41-39-34/h3-21H,2,22-23H2,1H3,(H,38,39,40,41)
n/an/a 0.0600n/an/an/an/an/an/a
TBA
Curated by ChEMBL
Assay Description
Displacement of [125 I]Sar1Ile8-AII from AT2 receptor of rat midbrain membrane
Bioorg Med Chem Lett 4: 1479-1484 (1994)
Article DOI: 10.1016/S0960-894X(01)80517-5
BindingDB Entry DOI: 10.7270/Q2BC401G
Angiotensin II type 1a (AT-1a) receptor
(RABBIT)
BDBM50282708
(CHEMBL289472 | Thiophene-2-carboxylic acid benzyl-...)
Show SMILES CCc1nc2ccc(cc2c(=O)n1Cc1ccc(cc1)-c1ccccc1-c1nnn[nH]1)N(Cc1ccccc1)C(=O)c1cccs1
Show InChI InChI=1S/C36H29N7O2S/c1-2-33-37-31-19-18-27(42(22-24-9-4-3-5-10-24)36(45)32-13-8-20-46-32)21-30(31)35(44)43(33)23-25-14-16-26(17-15-25)28-11-6-7-12-29(28)34-38-40-41-39-34/h3-21H,2,22-23H2,1H3,(H,38,39,40,41)
n/an/a 200n/an/an/an/an/an/a
TBA
Curated by ChEMBL
Assay Description
Displacement of [125 I]Sar1Ile8-AII from type 1 Angiotensin II receptor of rabbit aorta membrane
Bioorg Med Chem Lett 4: 1479-1484 (1994)
Article DOI: 10.1016/S0960-894X(01)80517-5
BindingDB Entry DOI: 10.7270/Q2BC401G