null
SMILES: CN1CCN=C1NCCCC(c1ccccc1)c1ccccc1
InChI Key: InChIKey=LJPXGVBNWUHMHS-UHFFFAOYSA-N
Activity Spreadsheet -- Enzyme Inhibition Constant Data from BindingDB
Found 1 hit for monomerid = 50283426
Trg + Lig
Ki
nM
ΔG°
kcal/mole
IC50
nM
Kd
nM
EC50/IC50
nM
koff
s-1
kon
M-1s-1
pHTemp
°C
Voltage-dependent L-type calcium channel subunit alpha-1C
(RAT)
BDBM50283426
((4,4-Diphenyl-butyl)-(1-methyl-4,5-dihydro-1H-imid...)
Show SMILES CN1CCN=C1NCCCC(c1ccccc1)c1ccccc1 |c:4|
Show InChI InChI=1S/C20H25N3/c1-23-16-15-22-20(23)21-14-8-13-19(17-9-4-2-5-10-17)18-11-6-3-7-12-18/h2-7,9-12,19H,8,13-16H2,1H3,(H,21,22)
n/an/a>1.00E+3n/an/an/an/an/an/a
TBA
Curated by ChEMBL
Assay Description
Binding of [3H]-nitrendipine to calcium channel in rat heart membranes was determined
Bioorg Med Chem Lett 4: 351-354 (1994)
Article DOI: 10.1016/S0960-894X(01)80143-8
BindingDB Entry DOI: 10.7270/Q2R78F5H