BDBM50283431 (2,2-Diphenyl-ethyl)-(3aS,7aS)-3a,4,5,6,7,7a-hexahydro-1H-benzoimidazol-2-yl-amine::CHEMBL117345
SMILES: C(NC1=N[C@H]2CCCC[C@@H]2N1)C(c1ccccc1)c1ccccc1
InChI Key: InChIKey=QUFOMZPBQCVTIG-PMACEKPBSA-N
Data: 1 IC50
Activity Spreadsheet -- Enzyme Inhibition Constant Data from BindingDB
Found 1 hit for monomerid = 50283431
Trg + Lig
Ki
nM
ΔG°
kcal/mole
IC50
nM
Kd
nM
EC50/IC50
nM
koff
s-1
kon
M-1s-1
pHTemp
°C
Calcium channel
(RAT)
BDBM50283431
((2,2-Diphenyl-ethyl)-(3aS,7aS)-3a,4,5,6,7,7a-hexah...)
Show SMILES C(NC1=N[C@H]2CCCC[C@@H]2N1)C(c1ccccc1)c1ccccc1 |t:2|
Show InChI InChI=1S/C21H25N3/c1-3-9-16(10-4-1)18(17-11-5-2-6-12-17)15-22-21-23-19-13-7-8-14-20(19)24-21/h1-6,9-12,18-20H,7-8,13-15H2,(H2,22,23,24)/t19-,20-/m0/s1
n/an/a>1.00E+3n/an/an/an/an/an/a
TBA
Curated by ChEMBL
Assay Description
Binding of [3H]-nitrendipine to calcium channel in rat heart membranes was determined
Bioorg Med Chem Lett 4: 351-354 (1994)
Article DOI: 10.1016/S0960-894X(01)80143-8
BindingDB Entry DOI: 10.7270/Q2R78F5H