BDBM50283432 Benzhydryl-(4,5-dihydro-1H-imidazol-2-yl)-amine::CHEMBL331328
SMILES: [#6]-1-[#6]-[#7]\[#6](-[#7]-1)=[#7]\[#6](-c1ccccc1)-c1ccccc1
InChI Key: InChIKey=UZQOTGNKCVYIFU-UHFFFAOYSA-N
Data: 1 IC50
Activity Spreadsheet -- Enzyme Inhibition Constant Data from BindingDB
Found 1 hit for monomerid = 50283432
Trg + Lig
Ki
nM
ΔG°
kcal/mole
IC50
nM
Kd
nM
EC50/IC50
nM
koff
s-1
kon
M-1s-1
pHTemp
°C
Voltage-dependent L-type calcium channel subunit alpha-1C
(RAT)
BDBM50283432
(Benzhydryl-(4,5-dihydro-1H-imidazol-2-yl)-amine | ...)
Show SMILES [#6]-1-[#6]-[#7]\[#6](-[#7]-1)=[#7]\[#6](-c1ccccc1)-c1ccccc1
Show InChI InChI=1S/C16H17N3/c1-3-7-13(8-4-1)15(14-9-5-2-6-10-14)19-16-17-11-12-18-16/h1-10,15H,11-12H2,(H2,17,18,19)
n/an/a>1.00E+3n/an/an/an/an/an/a
TBA
Curated by ChEMBL
Assay Description
Binding of [3H]-nitrendipine to calcium channel in rat heart membranes was determined
Bioorg Med Chem Lett 4: 351-354 (1994)
Article DOI: 10.1016/S0960-894X(01)80143-8
BindingDB Entry DOI: 10.7270/Q2R78F5H