null
SMILES: CN1CCN=C1NCC(c1ccccc1)c1ccccc1
InChI Key: InChIKey=CNUVHRANUPJXQR-UHFFFAOYSA-N
Activity Spreadsheet -- Enzyme Inhibition Constant Data from BindingDB
Found 1 hit for monomerid = 50283433
Trg + Lig
Ki
nM
ΔG°
kcal/mole
IC50
nM
Kd
nM
EC50/IC50
nM
koff
s-1
kon
M-1s-1
pHTemp
°C
Voltage-dependent L-type calcium channel subunit alpha-1C
(RAT)
BDBM50283433
((2,2-Diphenyl-ethyl)-(1-methyl-4,5-dihydro-1H-imid...)
Show SMILES CN1CCN=C1NCC(c1ccccc1)c1ccccc1 |c:4|
Show InChI InChI=1S/C18H21N3/c1-21-13-12-19-18(21)20-14-17(15-8-4-2-5-9-15)16-10-6-3-7-11-16/h2-11,17H,12-14H2,1H3,(H,19,20)
n/an/a>1.00E+3n/an/an/an/an/an/a
TBA
Curated by ChEMBL
Assay Description
Binding of [3H]-nitrendipine to calcium channel in rat heart membranes was determined
Bioorg Med Chem Lett 4: 351-354 (1994)
Article DOI: 10.1016/S0960-894X(01)80143-8
BindingDB Entry DOI: 10.7270/Q2R78F5H