null
SMILES: C(CC(c1ccccc1)c1ccccc1)NC1=NCCN1
InChI Key: InChIKey=XTUWGWFFVIACKD-UHFFFAOYSA-N
Activity Spreadsheet -- Enzyme Inhibition Constant Data from BindingDB
Found 1 hit for monomerid = 50283435
Trg + Lig
Ki
nM
ΔG°
kcal/mole
IC50
nM
Kd
nM
EC50/IC50
nM
koff
s-1
kon
M-1s-1
pHTemp
°C
Voltage-dependent L-type calcium channel subunit alpha-1C
(RAT)
BDBM50283435
((4,5-Dihydro-1H-imidazol-2-yl)-(3,3-diphenyl-propy...)
Show SMILES C(CC(c1ccccc1)c1ccccc1)NC1=NCCN1 |t:18|
Show InChI InChI=1S/C18H21N3/c1-3-7-15(8-4-1)17(16-9-5-2-6-10-16)11-12-19-18-20-13-14-21-18/h1-10,17H,11-14H2,(H2,19,20,21)
n/an/a>1.00E+3n/an/an/an/an/an/a
TBA
Curated by ChEMBL
Assay Description
Binding of [3H]-nitrendipine to calcium channel in rat heart membranes was determined
Bioorg Med Chem Lett 4: 351-354 (1994)
Article DOI: 10.1016/S0960-894X(01)80143-8
BindingDB Entry DOI: 10.7270/Q2R78F5H