BDBM50283609 (3S,5S)-4-(3-Biphenyl-4-yl-2-mercaptomethyl-propionylamino)-1-((S)-3-mercapto-2-methyl-propionyl)-pyrrolidine-2-carboxylic acid::CHEMBL89547
SMILES: C[C@H](CS)C(=O)N1C[C@H](C[C@H]1C(O)=O)NC(=O)C(CS)Cc1ccc(cc1)-c1ccccc1
InChI Key: InChIKey=ZNARJYBXPNSEKX-MABNFEJOSA-N
Data: 2 IC50
Activity Spreadsheet -- Enzyme Inhibition Constant Data from BindingDB
Found 2 hits for monomerid = 50283609
Trg + Lig
Ki
nM
ΔG°
kcal/mole
IC50
nM
Kd
nM
EC50/IC50
nM
koff
s-1
kon
M-1s-1
pHTemp
°C
Neutral Endopeptidase (NEP)
(Rattus norvegicus (Rat))
BDBM50283609
((3S,5S)-4-(3-Biphenyl-4-yl-2-mercaptomethyl-propio...)
Show SMILES C[C@H](CS)C(=O)N1C[C@H](C[C@H]1C(O)=O)NC(=O)C(CS)Cc1ccc(cc1)-c1ccccc1
Show InChI InChI=1S/C25H30N2O4S2/c1-16(14-32)24(29)27-13-21(12-22(27)25(30)31)26-23(28)20(15-33)11-17-7-9-19(10-8-17)18-5-3-2-4-6-18/h2-10,16,20-22,32-33H,11-15H2,1H3,(H,26,28)(H,30,31)/t16-,20?,21+,22+/m1/s1
Reactome pathway
n/an/a 20n/an/an/an/an/an/a
TBA
Curated by ChEMBL
Assay Description
In vitro inhibition against neutral endopeptidase 24.11 (NEP) in rat kidney cortex membrane
Bioorg Med Chem Lett 4: 2673-2676 (1994)
Article DOI: 10.1016/S0960-894X(01)80694-6
BindingDB Entry DOI: 10.7270/Q2X34XXT
Angiotensin-converting enzyme
(Homo sapiens (Human))
BDBM50283609
((3S,5S)-4-(3-Biphenyl-4-yl-2-mercaptomethyl-propio...)
Show SMILES C[C@H](CS)C(=O)N1C[C@H](C[C@H]1C(O)=O)NC(=O)C(CS)Cc1ccc(cc1)-c1ccccc1
Show InChI InChI=1S/C25H30N2O4S2/c1-16(14-32)24(29)27-13-21(12-22(27)25(30)31)26-23(28)20(15-33)11-17-7-9-19(10-8-17)18-5-3-2-4-6-18/h2-10,16,20-22,32-33H,11-15H2,1H3,(H,26,28)(H,30,31)/t16-,20?,21+,22+/m1/s1
Reactome pathway
n/an/a 696n/an/an/an/an/an/a
TBA
Curated by ChEMBL
Assay Description
In vitro inhibition against angiotensin converting enzyme (ACE)
Bioorg Med Chem Lett 4: 2673-2676 (1994)
Article DOI: 10.1016/S0960-894X(01)80694-6
BindingDB Entry DOI: 10.7270/Q2X34XXT