BDBM50283643 (S)-3-Biphenyl-4-yl-2-[(S)-3,3-dimethyl-2-(phosphonomethyl-amino)-butyrylamino]-propionic acid::CHEMBL93206
SMILES: CC(C)(C)[C@H](NCP(O)(O)=O)C(=O)N[C@@H](Cc1ccc(cc1)-c1ccccc1)C(O)=O
InChI Key: InChIKey=XFGVZQGVPSMUPV-RBUKOAKNSA-N
Data: 2 IC50
Activity Spreadsheet -- Enzyme Inhibition Constant Data from BindingDB
Found 2 hits for monomerid = 50283643
Trg + Lig
Ki
nM
ΔG°
kcal/mole
IC50
nM
Kd
nM
EC50/IC50
nM
koff
s-1
kon
M-1s-1
pHTemp
°C
ACEI-ACE2
(Homo sapiens (Human))
BDBM50283643
((S)-3-Biphenyl-4-yl-2-[(S)-3,3-dimethyl-2-(phospho...)
Show SMILES CC(C)(C)[C@H](NCP(O)(O)=O)C(=O)N[C@@H](Cc1ccc(cc1)-c1ccccc1)C(O)=O
Show InChI InChI=1S/C22H29N2O6P/c1-22(2,3)19(23-14-31(28,29)30)20(25)24-18(21(26)27)13-15-9-11-17(12-10-15)16-7-5-4-6-8-16/h4-12,18-19,23H,13-14H2,1-3H3,(H,24,25)(H,26,27)(H2,28,29,30)/t18-,19+/m0/s1
NCI pathway
Reactome pathway
n/an/a>1.00E+3n/an/an/an/an/an/a
TBA
Curated by ChEMBL
Assay Description
In vitro inhibitory concentration against angiotensin-converting enzyme
Bioorg Med Chem Lett 4: 2715-2720 (1994)
Article DOI: 10.1016/S0960-894X(01)80703-4
BindingDB Entry DOI: 10.7270/Q2SB467B
Neprilysin
(Homo sapiens (Human))
BDBM50283643
((S)-3-Biphenyl-4-yl-2-[(S)-3,3-dimethyl-2-(phospho...)
Show SMILES CC(C)(C)[C@H](NCP(O)(O)=O)C(=O)N[C@@H](Cc1ccc(cc1)-c1ccccc1)C(O)=O
Show InChI InChI=1S/C22H29N2O6P/c1-22(2,3)19(23-14-31(28,29)30)20(25)24-18(21(26)27)13-15-9-11-17(12-10-15)16-7-5-4-6-8-16/h4-12,18-19,23H,13-14H2,1-3H3,(H,24,25)(H,26,27)(H2,28,29,30)/t18-,19+/m0/s1
n/an/a>1.00E+3n/an/an/an/an/an/a
TBA
Curated by ChEMBL
Assay Description
In vitro inhibitory concentration against neutral endopeptidase
Bioorg Med Chem Lett 4: 2715-2720 (1994)
Article DOI: 10.1016/S0960-894X(01)80703-4
BindingDB Entry DOI: 10.7270/Q2SB467B