null
SMILES: CCCCc1nn(-c2ccccc2C(F)(F)F)c(=O)n1Cc1ccc(cc1)-c1cc(CCC)ccc1S(=O)(=O)NC(=O)OC(C)(C)C
InChI Key: InChIKey=IKSMFLPUCVAYHQ-UHFFFAOYSA-N
Activity Spreadsheet -- Enzyme Inhibition Constant Data from BindingDB
Found 4 hits for monomerid = 50283764
Trg + Lig
Ki
nM
ΔG°
kcal/mole
IC50
nM
Kd
nM
EC50/IC50
nM
koff
s-1
kon
M-1s-1
pHTemp
°C
Type-1 angiotensin II receptor
(Homo sapiens (Human))
BDBM50283764
(4'-[3-Butyl-5-oxo-1-(2-trifluoromethyl-phenyl)-1,5...)
Show SMILES CCCCc1nn(-c2ccccc2C(F)(F)F)c(=O)n1Cc1ccc(cc1)-c1cc(CCC)ccc1S(=O)(=O)NC(=O)OC(C)(C)C
Show InChI InChI=1S/C34H39F3N4O5S/c1-6-8-14-30-38-41(28-13-10-9-12-27(28)34(35,36)37)32(43)40(30)22-24-15-18-25(19-16-24)26-21-23(11-7-2)17-20-29(26)47(44,45)39-31(42)46-33(3,4)5/h9-10,12-13,15-21H,6-8,11,14,22H2,1-5H3,(H,39,42)
Reactome pathway
n/an/a 150n/an/an/an/an/an/a
TBA
Curated by ChEMBL
Assay Description
In vitro inhibitory concentration of the compound against AT1 receptor from human adrenal tissues.
Bioorg Med Chem Lett 4: 2787-2792 (1994)
Article DOI: 10.1016/S0960-894X(01)80595-3
BindingDB Entry DOI: 10.7270/Q2WS8T68
Type-2 angiotensin II receptor
(RAT)
BDBM50283764
(4'-[3-Butyl-5-oxo-1-(2-trifluoromethyl-phenyl)-1,5...)
Show SMILES CCCCc1nn(-c2ccccc2C(F)(F)F)c(=O)n1Cc1ccc(cc1)-c1cc(CCC)ccc1S(=O)(=O)NC(=O)OC(C)(C)C
Show InChI InChI=1S/C34H39F3N4O5S/c1-6-8-14-30-38-41(28-13-10-9-12-27(28)34(35,36)37)32(43)40(30)22-24-15-18-25(19-16-24)26-21-23(11-7-2)17-20-29(26)47(44,45)39-31(42)46-33(3,4)5/h9-10,12-13,15-21H,6-8,11,14,22H2,1-5H3,(H,39,42)
n/an/a 8.10n/an/an/an/an/an/a
TBA
Curated by ChEMBL
Assay Description
In vitro ability of the compound to inhibit the binding of radioligand 125I[Sar1,IIe8]AII to AT2 receptor from rat midbrain
Bioorg Med Chem Lett 4: 2787-2792 (1994)
Article DOI: 10.1016/S0960-894X(01)80595-3
BindingDB Entry DOI: 10.7270/Q2WS8T68
Type-2 angiotensin II receptor
(Homo sapiens (Human))
BDBM50283764
(4'-[3-Butyl-5-oxo-1-(2-trifluoromethyl-phenyl)-1,5...)
Show SMILES CCCCc1nn(-c2ccccc2C(F)(F)F)c(=O)n1Cc1ccc(cc1)-c1cc(CCC)ccc1S(=O)(=O)NC(=O)OC(C)(C)C
Show InChI InChI=1S/C34H39F3N4O5S/c1-6-8-14-30-38-41(28-13-10-9-12-27(28)34(35,36)37)32(43)40(30)22-24-15-18-25(19-16-24)26-21-23(11-7-2)17-20-29(26)47(44,45)39-31(42)46-33(3,4)5/h9-10,12-13,15-21H,6-8,11,14,22H2,1-5H3,(H,39,42)
n/an/a 270n/an/an/an/an/an/a
TBA
Curated by ChEMBL
Assay Description
In vitro inhibitory concentration of the compound against AT2 receptor from human adrenal tissues.
Bioorg Med Chem Lett 4: 2787-2792 (1994)
Article DOI: 10.1016/S0960-894X(01)80595-3
BindingDB Entry DOI: 10.7270/Q2WS8T68
Type-1 angiotensin II receptor
(RABBIT)
BDBM50283764
(4'-[3-Butyl-5-oxo-1-(2-trifluoromethyl-phenyl)-1,5...)
Show SMILES CCCCc1nn(-c2ccccc2C(F)(F)F)c(=O)n1Cc1ccc(cc1)-c1cc(CCC)ccc1S(=O)(=O)NC(=O)OC(C)(C)C
Show InChI InChI=1S/C34H39F3N4O5S/c1-6-8-14-30-38-41(28-13-10-9-12-27(28)34(35,36)37)32(43)40(30)22-24-15-18-25(19-16-24)26-21-23(11-7-2)17-20-29(26)47(44,45)39-31(42)46-33(3,4)5/h9-10,12-13,15-21H,6-8,11,14,22H2,1-5H3,(H,39,42)
n/an/a 10n/an/an/an/an/an/a
TBA
Curated by ChEMBL
Assay Description
In vitro ability of the compound to inhibit the binding of radioligand 125I[Sar1,IIe8]AII to AT1 receptor from rabbit aorta
Bioorg Med Chem Lett 4: 2787-2792 (1994)
Article DOI: 10.1016/S0960-894X(01)80595-3
BindingDB Entry DOI: 10.7270/Q2WS8T68