BDBM50283838 CHEMBL316504::N-tert-Butyl-2-[(3R,5S,7R)-2-oxo-5-phenyl-7-m-tolyl-3-(3-m-tolyl-ureido)-azepan-1-yl]-acetamide
SMILES: Cc1cccc(NC(=O)N[C@@H]2C[C@@H](C[C@@H](N(CC(=O)NC(C)(C)C)C2=O)c2cccc(C)c2)c2ccccc2)c1
InChI Key: InChIKey=DXRCYRRBLUBBSH-WIIGKZCBSA-N
Data: 2 IC50
Activity Spreadsheet -- Enzyme Inhibition Constant Data from BindingDB
Found 2 hits for monomerid = 50283838
Trg + Lig
Ki
nM
ΔG°
kcal/mole
IC50
nM
Kd
nM
EC50/IC50
nM
koff
s-1
kon
M-1s-1
pHTemp
°C
Cholecystokinin receptor
(Homo sapiens (Human))
BDBM50283838
(CHEMBL316504 | N-tert-Butyl-2-[(3R,5S,7R)-2-oxo-5-...)
Show SMILES Cc1cccc(NC(=O)N[C@@H]2C[C@@H](C[C@@H](N(CC(=O)NC(C)(C)C)C2=O)c2cccc(C)c2)c2ccccc2)c1
Show InChI InChI=1S/C33H40N4O3/c1-22-11-9-15-25(17-22)29-20-26(24-13-7-6-8-14-24)19-28(31(39)37(29)21-30(38)36-33(3,4)5)35-32(40)34-27-16-10-12-23(2)18-27/h6-18,26,28-29H,19-21H2,1-5H3,(H,36,38)(H2,34,35,40)/t26-,28+,29+/m0/s1
Reactome pathway
n/an/a 141n/an/an/an/an/an/a
TBA
Curated by ChEMBL
Assay Description
Inhibitory activity against cholecystokinin-B (CCK-B) receptor in cortex of male hartley guinea pig.
Bioorg Med Chem Lett 4: 2877-2882 (1994)
Article DOI: 10.1016/S0960-894X(01)80832-5
BindingDB Entry DOI: 10.7270/Q24B318F
Cholecystokinin A receptor
(Cavia porcellus)
BDBM50283838
(CHEMBL316504 | N-tert-Butyl-2-[(3R,5S,7R)-2-oxo-5-...)
Show SMILES Cc1cccc(NC(=O)N[C@@H]2C[C@@H](C[C@@H](N(CC(=O)NC(C)(C)C)C2=O)c2cccc(C)c2)c2ccccc2)c1
Show InChI InChI=1S/C33H40N4O3/c1-22-11-9-15-25(17-22)29-20-26(24-13-7-6-8-14-24)19-28(31(39)37(29)21-30(38)36-33(3,4)5)35-32(40)34-27-16-10-12-23(2)18-27/h6-18,26,28-29H,19-21H2,1-5H3,(H,36,38)(H2,34,35,40)/t26-,28+,29+/m0/s1
Reactome pathway
n/an/a 1.60n/an/an/an/an/an/a
TBA
Curated by ChEMBL
Assay Description
Inhibitory activity against cholecystokinin-A (CCK-A) receptor in pancreas of guinea pig.
Bioorg Med Chem Lett 4: 2877-2882 (1994)
Article DOI: 10.1016/S0960-894X(01)80832-5
BindingDB Entry DOI: 10.7270/Q24B318F