BDBM50285068 (S)-2-{[(1S,2S)-3-(3,4-Dichloro-phenyl)-2-(2-fluoro-biphenyl-4-yl)-1-methyl-propylcarbamoyl]-methyl}-succinic acid::CHEMBL61985
SMILES: C[C@H](NC(=O)C[C@@H](CC(O)=O)C(O)=O)[C@@H](Cc1ccc(Cl)c(Cl)c1)c1ccc(c(F)c1)-c1ccccc1
InChI Key: InChIKey=NBRLADMQSZWKGO-XUEUYAKLSA-N
Data: 3 IC50
Activity Spreadsheet -- Enzyme Inhibition Constant Data from BindingDB
Found 3 hits for monomerid = 50285068
Trg + Lig
Ki
nM
ΔG°
kcal/mole
IC50
nM
Kd
nM
EC50/IC50
nM
koff
s-1
kon
M-1s-1
pHTemp
°C
Squalene synthetase
(Homo sapiens (Human))
BDBM50285068
((S)-2-{[(1S,2S)-3-(3,4-Dichloro-phenyl)-2-(2-fluor...)
Show SMILES C[C@H](NC(=O)C[C@@H](CC(O)=O)C(O)=O)[C@@H](Cc1ccc(Cl)c(Cl)c1)c1ccc(c(F)c1)-c1ccccc1
Show InChI InChI=1S/C28H26Cl2FNO5/c1-16(32-26(33)14-20(28(36)37)15-27(34)35)22(11-17-7-10-23(29)24(30)12-17)19-8-9-21(25(31)13-19)18-5-3-2-4-6-18/h2-10,12-13,16,20,22H,11,14-15H2,1H3,(H,32,33)(H,34,35)(H,36,37)/t16-,20-,22+/m0/s1
Reactome pathway
n/an/a>300n/an/an/an/an/an/a
TBA
Curated by ChEMBL
Assay Description
Inhibitory activity against HepG2 Squalene Synthase (SQS)
Bioorg Med Chem Lett 5: 1989-1994 (1995)
Article DOI: 10.1016/0960-894X(95)00339-U
BindingDB Entry DOI: 10.7270/Q2B56K6F
Squalene synthetase
(Homo sapiens (Human))
BDBM50285068
((S)-2-{[(1S,2S)-3-(3,4-Dichloro-phenyl)-2-(2-fluor...)
Show SMILES C[C@H](NC(=O)C[C@@H](CC(O)=O)C(O)=O)[C@@H](Cc1ccc(Cl)c(Cl)c1)c1ccc(c(F)c1)-c1ccccc1
Show InChI InChI=1S/C28H26Cl2FNO5/c1-16(32-26(33)14-20(28(36)37)15-27(34)35)22(11-17-7-10-23(29)24(30)12-17)19-8-9-21(25(31)13-19)18-5-3-2-4-6-18/h2-10,12-13,16,20,22H,11,14-15H2,1H3,(H,32,33)(H,34,35)(H,36,37)/t16-,20-,22+/m0/s1
Reactome pathway
n/an/a 0.520n/an/an/an/an/an/a
TBA
Curated by ChEMBL
Assay Description
Inhibitory activity against HepG2 Squalene Synthase (SQS)
Bioorg Med Chem Lett 5: 1989-1994 (1995)
Article DOI: 10.1016/0960-894X(95)00339-U
BindingDB Entry DOI: 10.7270/Q2B56K6F
Squalene synthetase
(Homo sapiens (Human))
BDBM50285068
((S)-2-{[(1S,2S)-3-(3,4-Dichloro-phenyl)-2-(2-fluor...)
Show SMILES C[C@H](NC(=O)C[C@@H](CC(O)=O)C(O)=O)[C@@H](Cc1ccc(Cl)c(Cl)c1)c1ccc(c(F)c1)-c1ccccc1
Show InChI InChI=1S/C28H26Cl2FNO5/c1-16(32-26(33)14-20(28(36)37)15-27(34)35)22(11-17-7-10-23(29)24(30)12-17)19-8-9-21(25(31)13-19)18-5-3-2-4-6-18/h2-10,12-13,16,20,22H,11,14-15H2,1H3,(H,32,33)(H,34,35)(H,36,37)/t16-,20-,22+/m0/s1
Reactome pathway
n/an/a 0.520n/an/an/an/an/an/a
TBA
Curated by ChEMBL
Assay Description
Inhibitory activity of the compound against squalene synthase (SQS) obtained from HepG2 cells
Bioorg Med Chem Lett 6: 463-466 (1996)
Article DOI: 10.1016/0960-894X(96)00033-9
BindingDB Entry DOI: 10.7270/Q2MG7PG7