BDBM50285090 4-(2-Carboxy-6-hydroxy-benzoyl)-3,5-dihydroxy-benzoic acid(3R,4R)-2-(4-hydroxy-benzoylamino)-cyclopentylmethyl ester::CHEMBL60455
SMILES: OC(=O)c1cccc(O)c1C(=O)c1c(O)cc(cc1O)C(=O)OC[C@@H]1CCC[C@H]1NC(=O)c1ccc(O)cc1
InChI Key: InChIKey=ZOGSVRRXRLSQNC-HNAYVOBHSA-N
Data: 8 IC50
Activity Spreadsheet -- Enzyme Inhibition Constant Data from BindingDB
Found 8 hits for monomerid = 50285090
Trg + Lig
Ki
nM
ΔG°
kcal/mole
IC50
nM
Kd
nM
EC50/IC50
nM
koff
s-1
kon
M-1s-1
pHTemp
°C
Protein kinase C, eta
(Homo sapiens (Human))
BDBM50285090
(4-(2-Carboxy-6-hydroxy-benzoyl)-3,5-dihydroxy-benz...)
Show SMILES OC(=O)c1cccc(O)c1C(=O)c1c(O)cc(cc1O)C(=O)OC[C@@H]1CCC[C@H]1NC(=O)c1ccc(O)cc1
Show InChI InChI=1S/C28H25NO10/c30-17-9-7-14(8-10-17)26(35)29-19-5-1-3-15(19)13-39-28(38)16-11-21(32)24(22(33)12-16)25(34)23-18(27(36)37)4-2-6-20(23)31/h2,4,6-12,15,19,30-33H,1,3,5,13H2,(H,29,35)(H,36,37)/t15-,19+/m0/s1
NCI pathway
Reactome pathway
n/an/a 20n/an/an/an/an/an/a
TBA
Curated by ChEMBL
Assay Description
Inhibition of Protein kinase C eta
Bioorg Med Chem Lett 5: 2015-2020 (1995)
Article DOI: 10.1016/0960-894X(95)00344-S
BindingDB Entry DOI: 10.7270/Q29C6XD1
PKC alpha and beta-2
(Homo sapiens (Human))
BDBM50285090
(4-(2-Carboxy-6-hydroxy-benzoyl)-3,5-dihydroxy-benz...)
Show SMILES OC(=O)c1cccc(O)c1C(=O)c1c(O)cc(cc1O)C(=O)OC[C@@H]1CCC[C@H]1NC(=O)c1ccc(O)cc1
Show InChI InChI=1S/C28H25NO10/c30-17-9-7-14(8-10-17)26(35)29-19-5-1-3-15(19)13-39-28(38)16-11-21(32)24(22(33)12-16)25(34)23-18(27(36)37)4-2-6-20(23)31/h2,4,6-12,15,19,30-33H,1,3,5,13H2,(H,29,35)(H,36,37)/t15-,19+/m0/s1
NCI pathway
Reactome pathway
n/an/a 30n/an/an/an/an/an/a
TBA
Curated by ChEMBL
Assay Description
Inhibition of Protein kinase C beta 2
Bioorg Med Chem Lett 5: 2015-2020 (1995)
Article DOI: 10.1016/0960-894X(95)00344-S
BindingDB Entry DOI: 10.7270/Q29C6XD1
Protein kinase C alpha type
(Homo sapiens (Human))
BDBM50285090
(4-(2-Carboxy-6-hydroxy-benzoyl)-3,5-dihydroxy-benz...)
Show SMILES OC(=O)c1cccc(O)c1C(=O)c1c(O)cc(cc1O)C(=O)OC[C@@H]1CCC[C@H]1NC(=O)c1ccc(O)cc1
Show InChI InChI=1S/C28H25NO10/c30-17-9-7-14(8-10-17)26(35)29-19-5-1-3-15(19)13-39-28(38)16-11-21(32)24(22(33)12-16)25(34)23-18(27(36)37)4-2-6-20(23)31/h2,4,6-12,15,19,30-33H,1,3,5,13H2,(H,29,35)(H,36,37)/t15-,19+/m0/s1
NCI pathway
Reactome pathway
n/an/a 40n/an/an/an/an/an/a
TBA
Curated by ChEMBL
Assay Description
Inhibition of Protein kinase C alpha
Bioorg Med Chem Lett 5: 2015-2020 (1995)
Article DOI: 10.1016/0960-894X(95)00344-S
BindingDB Entry DOI: 10.7270/Q29C6XD1
PKC alpha and beta-2
(Homo sapiens (Human))
BDBM50285090
(4-(2-Carboxy-6-hydroxy-benzoyl)-3,5-dihydroxy-benz...)
Show SMILES OC(=O)c1cccc(O)c1C(=O)c1c(O)cc(cc1O)C(=O)OC[C@@H]1CCC[C@H]1NC(=O)c1ccc(O)cc1
Show InChI InChI=1S/C28H25NO10/c30-17-9-7-14(8-10-17)26(35)29-19-5-1-3-15(19)13-39-28(38)16-11-21(32)24(22(33)12-16)25(34)23-18(27(36)37)4-2-6-20(23)31/h2,4,6-12,15,19,30-33H,1,3,5,13H2,(H,29,35)(H,36,37)/t15-,19+/m0/s1
NCI pathway
Reactome pathway
n/an/a 40n/an/an/an/an/an/a
TBA
Curated by ChEMBL
Assay Description
Inhibition of Protein kinase C zeta
Bioorg Med Chem Lett 5: 2015-2020 (1995)
Article DOI: 10.1016/0960-894X(95)00344-S
BindingDB Entry DOI: 10.7270/Q29C6XD1
Protein kinase C, epsilon
(Homo sapiens (Human))
BDBM50285090
(4-(2-Carboxy-6-hydroxy-benzoyl)-3,5-dihydroxy-benz...)
Show SMILES OC(=O)c1cccc(O)c1C(=O)c1c(O)cc(cc1O)C(=O)OC[C@@H]1CCC[C@H]1NC(=O)c1ccc(O)cc1
Show InChI InChI=1S/C28H25NO10/c30-17-9-7-14(8-10-17)26(35)29-19-5-1-3-15(19)13-39-28(38)16-11-21(32)24(22(33)12-16)25(34)23-18(27(36)37)4-2-6-20(23)31/h2,4,6-12,15,19,30-33H,1,3,5,13H2,(H,29,35)(H,36,37)/t15-,19+/m0/s1
NCI pathway
Reactome pathway
n/an/a 340n/an/an/an/an/an/a
TBA
Curated by ChEMBL
Assay Description
Inhibition of Protein kinase C epsilon
Bioorg Med Chem Lett 5: 2015-2020 (1995)
Article DOI: 10.1016/0960-894X(95)00344-S
BindingDB Entry DOI: 10.7270/Q29C6XD1
Protein kinase C (PKC)
(Homo sapiens (Human))
BDBM50285090
(4-(2-Carboxy-6-hydroxy-benzoyl)-3,5-dihydroxy-benz...)
Show SMILES OC(=O)c1cccc(O)c1C(=O)c1c(O)cc(cc1O)C(=O)OC[C@@H]1CCC[C@H]1NC(=O)c1ccc(O)cc1
Show InChI InChI=1S/C28H25NO10/c30-17-9-7-14(8-10-17)26(35)29-19-5-1-3-15(19)13-39-28(38)16-11-21(32)24(22(33)12-16)25(34)23-18(27(36)37)4-2-6-20(23)31/h2,4,6-12,15,19,30-33H,1,3,5,13H2,(H,29,35)(H,36,37)/t15-,19+/m0/s1
NCI pathway
Reactome pathway
n/an/a>5.00E+4n/an/an/an/an/an/a
TBA
Curated by ChEMBL
Assay Description
Inhibition of Protein kinase C zeta
Bioorg Med Chem Lett 5: 2015-2020 (1995)
Article DOI: 10.1016/0960-894X(95)00344-S
BindingDB Entry DOI: 10.7270/Q29C6XD1
Protein kinase C delta type
(Homo sapiens (Human))
BDBM50285090
(4-(2-Carboxy-6-hydroxy-benzoyl)-3,5-dihydroxy-benz...)
Show SMILES OC(=O)c1cccc(O)c1C(=O)c1c(O)cc(cc1O)C(=O)OC[C@@H]1CCC[C@H]1NC(=O)c1ccc(O)cc1
Show InChI InChI=1S/C28H25NO10/c30-17-9-7-14(8-10-17)26(35)29-19-5-1-3-15(19)13-39-28(38)16-11-21(32)24(22(33)12-16)25(34)23-18(27(36)37)4-2-6-20(23)31/h2,4,6-12,15,19,30-33H,1,3,5,13H2,(H,29,35)(H,36,37)/t15-,19+/m0/s1
NCI pathway
Reactome pathway
n/an/a 20n/an/an/an/an/an/a
TBA
Curated by ChEMBL
Assay Description
Inhibition of Protein kinase C delta
Bioorg Med Chem Lett 5: 2015-2020 (1995)
Article DOI: 10.1016/0960-894X(95)00344-S
BindingDB Entry DOI: 10.7270/Q29C6XD1
Protein kinase C, gamma
(Homo sapiens (Human))
BDBM50285090
(4-(2-Carboxy-6-hydroxy-benzoyl)-3,5-dihydroxy-benz...)
Show SMILES OC(=O)c1cccc(O)c1C(=O)c1c(O)cc(cc1O)C(=O)OC[C@@H]1CCC[C@H]1NC(=O)c1ccc(O)cc1
Show InChI InChI=1S/C28H25NO10/c30-17-9-7-14(8-10-17)26(35)29-19-5-1-3-15(19)13-39-28(38)16-11-21(32)24(22(33)12-16)25(34)23-18(27(36)37)4-2-6-20(23)31/h2,4,6-12,15,19,30-33H,1,3,5,13H2,(H,29,35)(H,36,37)/t15-,19+/m0/s1
NCI pathway
Reactome pathway
n/an/a 300n/an/an/an/an/an/a
TBA
Curated by ChEMBL
Assay Description
Inhibition of Protein kinase C gamma
Bioorg Med Chem Lett 5: 2015-2020 (1995)
Article DOI: 10.1016/0960-894X(95)00344-S
BindingDB Entry DOI: 10.7270/Q29C6XD1