null
SMILES: CCN1c2cnccc2N(C)C(=O)c2cccnc12
InChI Key: InChIKey=BTVNZENHERGVST-UHFFFAOYSA-N
Activity Spreadsheet -- Enzyme Inhibition Constant Data from BindingDB
Found 1 hit for monomerid = 50285362
Trg + Lig
Ki
nM
ΔG°
kcal/mole
IC50
nM
Kd
nM
EC50/IC50
nM
koff
s-1
kon
M-1s-1
pHTemp
°C
Reverse transcriptase/RNaseH
(Human immunodeficiency virus 1)
BDBM50285362
(5-Ethyl-11-methyl-5,11-dihydro-3,5,6,11-tetraaza-d...)
Show SMILES CCN1c2cnccc2N(C)C(=O)c2cccnc12
Show InChI InChI=1S/C14H14N4O/c1-3-18-12-9-15-8-6-11(12)17(2)14(19)10-5-4-7-16-13(10)18/h4-9H,3H2,1-2H3
n/an/a 350n/an/an/an/an/an/a
TBA
Curated by ChEMBL
Assay Description
Inhibitory activity against HIV-1 Reverse transcriptase(RT) was determined
Bioorg Med Chem Lett 5: 163-166 (1995)
Article DOI: 10.1016/0960-894X(94)00478-X
BindingDB Entry DOI: 10.7270/Q22R3RM4