BDBM50285432 1N,1N-dimethyl-4-[2-{5-[4,5-di(4-dimethylaminophenyl)-1H-2-imidazolylsulfanyl]pentylsulfanyl}-5-(4-dimethylaminophenyl)-1H-4-imidazolyl]aniline::CHEMBL50131
SMILES: CN(C)c1ccc(cc1)-c1nc(SCCCCCSc2nc(c([nH]2)-c2ccc(cc2)N(C)C)-c2ccc(cc2)N(C)C)[nH]c1-c1ccc(cc1)N(C)C
InChI Key: InChIKey=LOSSNRJIXWCAJB-UHFFFAOYSA-N
Data: 2 IC50
Activity Spreadsheet -- Enzyme Inhibition Constant Data from BindingDB
Found 2 hits for monomerid = 50285432
Trg + Lig
Ki
nM
ΔG°
kcal/mole
IC50
nM
Kd
nM
EC50/IC50
nM
koff
s-1
kon
M-1s-1
pHTemp
°C
Acyl coenzyme A:cholesterol acyltransferase 1
(Mus musculus)
BDBM50285432
(1N,1N-dimethyl-4-[2-{5-[4,5-di(4-dimethylaminophen...)
Show SMILES CN(C)c1ccc(cc1)-c1nc(SCCCCCSc2nc(c([nH]2)-c2ccc(cc2)N(C)C)-c2ccc(cc2)N(C)C)[nH]c1-c1ccc(cc1)N(C)C
Show InChI InChI=1S/C43H52N8S2/c1-48(2)34-20-12-30(13-21-34)38-39(31-14-22-35(23-15-31)49(3)4)45-42(44-38)52-28-10-9-11-29-53-43-46-40(32-16-24-36(25-17-32)50(5)6)41(47-43)33-18-26-37(27-19-33)51(7)8/h12-27H,9-11,28-29H2,1-8H3,(H,44,45)(H,46,47)
Reactome pathway
n/an/a 60n/an/an/an/an/an/a
TBA
Curated by ChEMBL
Assay Description
Inhibition of Acyl coenzyme A:cholesterol acyltransferase in J774 Macrophage cell culture
Bioorg Med Chem Lett 5: 177-180 (1995)
Article DOI: 10.1016/0960-894X(95)00003-C
BindingDB Entry DOI: 10.7270/Q2PG1RQJ
Sterol O-acyltransferase, Soat
(Rattus norvegicus)
BDBM50285432
(1N,1N-dimethyl-4-[2-{5-[4,5-di(4-dimethylaminophen...)
Show SMILES CN(C)c1ccc(cc1)-c1nc(SCCCCCSc2nc(c([nH]2)-c2ccc(cc2)N(C)C)-c2ccc(cc2)N(C)C)[nH]c1-c1ccc(cc1)N(C)C
Show InChI InChI=1S/C43H52N8S2/c1-48(2)34-20-12-30(13-21-34)38-39(31-14-22-35(23-15-31)49(3)4)45-42(44-38)52-28-10-9-11-29-53-43-46-40(32-16-24-36(25-17-32)50(5)6)41(47-43)33-18-26-37(27-19-33)51(7)8/h12-27H,9-11,28-29H2,1-8H3,(H,44,45)(H,46,47)
n/an/a 90n/an/an/an/an/an/a
TBA
Curated by ChEMBL
Assay Description
In vitro inhibition of Acyl coenzyme A:cholesterol acyltransferase in rat hepatic microsomes was measured by using AIV assay
Bioorg Med Chem Lett 5: 177-180 (1995)
Article DOI: 10.1016/0960-894X(95)00003-C
BindingDB Entry DOI: 10.7270/Q2PG1RQJ