BDBM50285971 CHEMBL95546::[(1S,2R)-1-Benzyl-3-((3aR,6S,7aS)-6-tert-butylcarbamoyl-hexahydro-thieno[3,2-c]pyridin-5-yl)-2-hydroxy-propyl]-carbamic acid (2R,3R)-2-isopropyl-tetrahydro-thiophen-3-yl ester
SMILES: CC(C)[C@H]1SCC[C@H]1OC(=O)N[C@@H](Cc1ccccc1)[C@H](O)CN1C[C@H]2CCS[C@H]2C[C@H]1C(=O)NC(C)(C)C
InChI Key: InChIKey=QLFYYBGXVAYDRB-GSYGMJNASA-N
Data: 1 IC50
Activity Spreadsheet -- Enzyme Inhibition Constant Data from BindingDB
Found 1 hit for monomerid = 50285971
Trg + Lig
Ki
nM
ΔG°
kcal/mole
IC50
nM
Kd
nM
EC50/IC50
nM
koff
s-1
kon
M-1s-1
pHTemp
°C
Human immunodeficiency virus type 1 protease
(Human immunodeficiency virus type 1)
BDBM50285971
(CHEMBL95546 | [(1S,2R)-1-Benzyl-3-((3aR,6S,7aS)-6-...)
Show SMILES CC(C)[C@H]1SCC[C@H]1OC(=O)N[C@@H](Cc1ccccc1)[C@H](O)CN1C[C@H]2CCS[C@H]2C[C@H]1C(=O)NC(C)(C)C
Show InChI InChI=1S/C30H47N3O4S2/c1-19(2)27-25(12-14-39-27)37-29(36)31-22(15-20-9-7-6-8-10-20)24(34)18-33-17-21-11-13-38-26(21)16-23(33)28(35)32-30(3,4)5/h6-10,19,21-27,34H,11-18H2,1-5H3,(H,31,36)(H,32,35)/t21-,22+,23+,24-,25-,26+,27-/m1/s1
n/an/a 0.260n/an/an/an/an/an/a
Lilly Research Laboratories
Assay Description
In vitro inhibition of HIV-1 protease.
Bioorg Med Chem Lett 5: 2891-6 (1995)
Article DOI: 10.1016/0960-894X(95)00507-P
BindingDB Entry DOI: 10.7270/Q2T43R7T