BDBM50286152 (R)-5-(4-Benzoyl-piperidin-1-yl)-5-oxo-4-(3-m-tolyl-ureido)-pentanoic acid::CHEMBL101752
SMILES: Cc1cccc(NC(=O)N[C@H](CCC(O)=O)C(=O)N2CCC(CC2)C(=O)c2ccccc2)c1
InChI Key: InChIKey=MCGMEEHYMPKNAM-OAQYLSRUSA-N
Data: 2 IC50
Activity Spreadsheet -- Enzyme Inhibition Constant Data from BindingDB
Found 2 hits for monomerid = 50286152
Trg + Lig
Ki
nM
ΔG°
kcal/mole
IC50
nM
Kd
nM
EC50/IC50
nM
koff
s-1
kon
M-1s-1
pHTemp
°C
Cholecystokinin receptor
(Homo sapiens (Human))
BDBM50286152
((R)-5-(4-Benzoyl-piperidin-1-yl)-5-oxo-4-(3-m-toly...)
Show SMILES Cc1cccc(NC(=O)N[C@H](CCC(O)=O)C(=O)N2CCC(CC2)C(=O)c2ccccc2)c1
Show InChI InChI=1S/C25H29N3O5/c1-17-6-5-9-20(16-17)26-25(33)27-21(10-11-22(29)30)24(32)28-14-12-19(13-15-28)23(31)18-7-3-2-4-8-18/h2-9,16,19,21H,10-15H2,1H3,(H,29,30)(H2,26,27,33)/t21-/m1/s1
Reactome pathway
n/an/a 2.00E+3n/an/an/an/an/an/a
TBA
Curated by ChEMBL
Assay Description
Inhibitory activity towards binding of [125I]-Bolton-Hunter-CCK-8 to CCKB receptor in guinea pig cortical tissue
Bioorg Med Chem Lett 5: 3057-3062 (1995)
Article DOI: 10.1016/0960-894X(95)00537-3
BindingDB Entry DOI: 10.7270/Q2BZ6604
Cholecystokinin A receptor
(Cavia porcellus)
BDBM50286152
((R)-5-(4-Benzoyl-piperidin-1-yl)-5-oxo-4-(3-m-toly...)
Show SMILES Cc1cccc(NC(=O)N[C@H](CCC(O)=O)C(=O)N2CCC(CC2)C(=O)c2ccccc2)c1
Show InChI InChI=1S/C25H29N3O5/c1-17-6-5-9-20(16-17)26-25(33)27-21(10-11-22(29)30)24(32)28-14-12-19(13-15-28)23(31)18-7-3-2-4-8-18/h2-9,16,19,21H,10-15H2,1H3,(H,29,30)(H2,26,27,33)/t21-/m1/s1
Reactome pathway
n/an/a 1.80E+3n/an/an/an/an/an/a
TBA
Curated by ChEMBL
Assay Description
Inhibitory activity towards binding of [125I]-Bolton-Hunter-CCK-8 to CCKA receptor in guinea pig pancreatic tissue
Bioorg Med Chem Lett 5: 3057-3062 (1995)
Article DOI: 10.1016/0960-894X(95)00537-3
BindingDB Entry DOI: 10.7270/Q2BZ6604