BDBM50286153 5-(4-Benzoylamino-piperidin-1-yl)-5-(R)-oxo-4-(3-m-tolyl-ureido)-pentanoic acid benzyl ester::CHEMBL319466
SMILES: Cc1cccc(NC(=O)N[C@H](CCC(=O)OCc2ccccc2)C(=O)N2CCC(CC2)NC(=O)c2ccccc2)c1
InChI Key: InChIKey=KZFUFLCXQLPQDB-MUUNZHRXSA-N
Data: 2 IC50
Activity Spreadsheet -- Enzyme Inhibition Constant Data from BindingDB
Found 2 hits for monomerid = 50286153
Trg + Lig
Ki
nM
ΔG°
kcal/mole
IC50
nM
Kd
nM
EC50/IC50
nM
koff
s-1
kon
M-1s-1
pHTemp
°C
Cholecystokinin receptor
(Homo sapiens (Human))
BDBM50286153
(5-(4-Benzoylamino-piperidin-1-yl)-5-(R)-oxo-4-(3-m...)
Show SMILES Cc1cccc(NC(=O)N[C@H](CCC(=O)OCc2ccccc2)C(=O)N2CCC(CC2)NC(=O)c2ccccc2)c1
Show InChI InChI=1S/C32H36N4O5/c1-23-9-8-14-27(21-23)34-32(40)35-28(15-16-29(37)41-22-24-10-4-2-5-11-24)31(39)36-19-17-26(18-20-36)33-30(38)25-12-6-3-7-13-25/h2-14,21,26,28H,15-20,22H2,1H3,(H,33,38)(H2,34,35,40)/t28-/m1/s1
Reactome pathway
n/an/a>1.00E+4n/an/an/an/an/an/a
TBA
Curated by ChEMBL
Assay Description
Inhibitory activity towards binding of [125I]-Bolton-Hunter-CCK-8 to CCKB receptor in guinea pig cortical tissue
Bioorg Med Chem Lett 5: 3057-3062 (1995)
Article DOI: 10.1016/0960-894X(95)00537-3
BindingDB Entry DOI: 10.7270/Q2BZ6604
Cholecystokinin A receptor
(Cavia porcellus)
BDBM50286153
(5-(4-Benzoylamino-piperidin-1-yl)-5-(R)-oxo-4-(3-m...)
Show SMILES Cc1cccc(NC(=O)N[C@H](CCC(=O)OCc2ccccc2)C(=O)N2CCC(CC2)NC(=O)c2ccccc2)c1
Show InChI InChI=1S/C32H36N4O5/c1-23-9-8-14-27(21-23)34-32(40)35-28(15-16-29(37)41-22-24-10-4-2-5-11-24)31(39)36-19-17-26(18-20-36)33-30(38)25-12-6-3-7-13-25/h2-14,21,26,28H,15-20,22H2,1H3,(H,33,38)(H2,34,35,40)/t28-/m1/s1
Reactome pathway
n/an/a 970n/an/an/an/an/an/a
TBA
Curated by ChEMBL
Assay Description
Inhibitory activity towards binding of [125I]-Bolton-Hunter-CCK-8 to CCKA receptor in guinea pig pancreatic tissue
Bioorg Med Chem Lett 5: 3057-3062 (1995)
Article DOI: 10.1016/0960-894X(95)00537-3
BindingDB Entry DOI: 10.7270/Q2BZ6604