BDBM50288095 2-Ethoxy-benzo[d][1,3]oxazin-4-one::CHEMBL450273
SMILES: CCOc1nc2ccccc2c(=O)o1
InChI Key: InChIKey=LNKMWCFXYLCVPI-UHFFFAOYSA-N
Data: 1 KI  1 IC50  1 Koff  1 Kon
Activity Spreadsheet -- Enzyme Inhibition Constant Data from BindingDB
Found 2 hits for monomerid = 50288095
Trg + Lig
Ki
nM
ΔG°
kcal/mole
IC50
nM
Kd
nM
EC50/IC50
nM
koff
s-1
kon
M-1s-1
pHTemp
°C
Leukocyte elastase
(Homo sapiens (Human))
BDBM50288095
(2-Ethoxy-benzo[d][1,3]oxazin-4-one | CHEMBL450273)
Show SMILES CCOc1nc2ccccc2c(=O)o1
Show InChI InChI=1S/C10H9NO3/c1-2-13-10-11-8-6-4-3-5-7(8)9(12)14-10/h3-6H,2H2,1H3
Reactome pathway
6.31n/an/an/an/a 0.00102 1.59E+5n/an/a
Syntex Research
Curated by ChEMBL
Assay Description
Component deacylation rate constant for interaction with human leukocyte elastase
J Med Chem 33: 464-79 (1990)
Checked by Author
BindingDB Entry DOI: 10.7270/Q2PR7X6X
Human herpesvirus 1 protease
(Human herpesvirus 1 (strain 17) (HHV-1) (Human her...)
BDBM50288095
(2-Ethoxy-benzo[d][1,3]oxazin-4-one | CHEMBL450273)
Show SMILES CCOc1nc2ccccc2c(=O)o1
Show InChI InChI=1S/C10H9NO3/c1-2-13-10-11-8-6-4-3-5-7(8)9(12)14-10/h3-6H,2H2,1H3
n/an/a 2.50E+4n/an/an/an/an/an/a
TBA
Curated by ChEMBL
Assay Description
Inhibitory activity against herpes simplex type 1 protease (HSV-1 pr).
Bioorg Med Chem Lett 6: 2463-2466 (1996)
Article DOI: 10.1016/0960-894X(96)00455-6
BindingDB Entry DOI: 10.7270/Q2F47P4R