BDBM50288889 3-Hydroxy-2-{2-[2-(4-sulfamoyl-benzoylamino)-acetylamino]-acetylamino}-propionic acid::CHEMBL2371106
SMILES: NS(=O)(=O)c1ccc(cc1)C(=O)NCC(=O)NCC(=O)NCC(=O)N[C@@H](CO)C(O)=O
InChI Key: InChIKey=RLBAQJYWRWPYRE-NSHDSACASA-N
Data: 1 Kd
Activity Spreadsheet -- Enzyme Inhibition Constant Data from BindingDB
Found 1 hit for monomerid = 50288889
Trg + Lig
Ki
nM
ΔG°
kcal/mole
IC50
nM
Kd
nM
EC50/IC50
nM
koff
s-1
kon
M-1s-1
pHTemp
°C
Carbonic anhydrase 2
(Homo sapiens (Human))
BDBM50288889
(3-Hydroxy-2-{2-[2-(4-sulfamoyl-benzoylamino)-acety...)
Show SMILES NS(=O)(=O)c1ccc(cc1)C(=O)NCC(=O)NCC(=O)NCC(=O)N[C@@H](CO)C(O)=O |r|
Show InChI InChI=1S/C16H21N5O9S/c17-31(29,30)10-3-1-9(2-4-10)15(26)20-6-13(24)18-5-12(23)19-7-14(25)21-11(8-22)16(27)28/h1-4,11,22H,5-8H2,(H,18,24)(H,19,23)(H,20,26)(H,21,25)(H,27,28)(H2,17,29,30)/t11-/m0/s1
Reactome pathway
n/an/an/a 360n/an/an/an/an/a
TBA
Curated by ChEMBL
Assay Description
Dissociation constant against human carbonic anhydrase II at 37 degree centigrade
Bioorg Med Chem Lett 6: 559-564 (1996)
Article DOI: 10.1016/0960-894X(96)00069-8
BindingDB Entry DOI: 10.7270/Q2V124SF