BDBM50288891 3-Methyl-2-(2-{2-[2-(4-sulfamoyl-benzoylamino)-acetylamino]-acetylamino}-acetylamino)-butyric acid::CHEMBL2371077
SMILES: CC(C)[C@H](NC(=O)CNC(=O)CNC(=O)CNC(=O)c1ccc(cc1)S(N)(=O)=O)C(O)=O
InChI Key: InChIKey=UDSXLACJKUCCHB-INIZCTEOSA-N
Data: 1 Kd
Activity Spreadsheet -- Enzyme Inhibition Constant Data from BindingDB
Found 1 hit for monomerid = 50288891
Trg + Lig
Ki
nM
ΔG°
kcal/mole
IC50
nM
Kd
nM
EC50/IC50
nM
koff
s-1
kon
M-1s-1
pHTemp
°C
Carbonic anhydrase 2
(Homo sapiens (Human))
BDBM50288891
(3-Methyl-2-(2-{2-[2-(4-sulfamoyl-benzoylamino)-ace...)
Show SMILES CC(C)[C@H](NC(=O)CNC(=O)CNC(=O)CNC(=O)c1ccc(cc1)S(N)(=O)=O)C(O)=O |r|
Show InChI InChI=1S/C18H25N5O8S/c1-10(2)16(18(28)29)23-15(26)9-21-13(24)7-20-14(25)8-22-17(27)11-3-5-12(6-4-11)32(19,30)31/h3-6,10,16H,7-9H2,1-2H3,(H,20,25)(H,21,24)(H,22,27)(H,23,26)(H,28,29)(H2,19,30,31)/t16-/m0/s1
Reactome pathway
n/an/an/a 290n/an/an/an/an/a
TBA
Curated by ChEMBL
Assay Description
Dissociation constant against human carbonic anhydrase II at 37 degree centigrade
Bioorg Med Chem Lett 6: 559-564 (1996)
Article DOI: 10.1016/0960-894X(96)00069-8
BindingDB Entry DOI: 10.7270/Q2V124SF