BDBM50289139 3-((E)-2-Pyridin-2-yl-vinyl)-1H-indole::CHEMBL171548
SMILES: C(=C/c1ccccn1)\c1c[nH]c2ccccc12
InChI Key: InChIKey=OZPYZRJHDWCCQM-CMDGGOBGSA-N
Data: 1 KI  1 IC50
Activity Spreadsheet -- Enzyme Inhibition Constant Data from BindingDB
Found 2 hits for monomerid = 50289139
Trg + Lig
Ki
nM
ΔG°
kcal/mole
IC50
nM
Kd
nM
EC50/IC50
nM
koff
s-1
kon
M-1s-1
pHTemp
°C
Tryptophan 2,3-dioxygenase
(Rattus norvegicus)
BDBM50289139
(3-((E)-2-Pyridin-2-yl-vinyl)-1H-indole | CHEMBL171...)
Show SMILES C(=C/c1ccccn1)\c1c[nH]c2ccccc12
Show InChI InChI=1S/C15H12N2/c1-2-7-15-14(6-1)12(11-17-15)8-9-13-5-3-4-10-16-13/h1-11,17H/b9-8+
Reactome pathway
100n/an/an/an/an/an/an/an/a
TBA
Curated by ChEMBL
Assay Description
Compound was tested for inhibition of Tryptophan dioxygenase (TDO) from rat liver
Bioorg Med Chem Lett 6: 857-860 (1996)
Article DOI: 10.1016/0960-894X(96)00124-2
BindingDB Entry DOI: 10.7270/Q2833S17
Tryptophan 2,3-dioxygenase
(Mus musculus)
BDBM50289139
(3-((E)-2-Pyridin-2-yl-vinyl)-1H-indole | CHEMBL171...)
Show SMILES C(=C/c1ccccn1)\c1c[nH]c2ccccc12
Show InChI InChI=1S/C15H12N2/c1-2-7-15-14(6-1)12(11-17-15)8-9-13-5-3-4-10-16-13/h1-11,17H/b9-8+
Reactome pathway
n/an/a 2.00E+4n/an/an/an/an/an/a
University of Namur
Curated by ChEMBL
Assay Description
Inhibition of mouse TDO expressed in mouse P815B cells assessed as inhibition of tryptophan catabolism by measuring kynurenine production after 8 hrs...
J Med Chem 54: 5320-34 (2011)
Article DOI: 10.1021/jm2006782
BindingDB Entry DOI: 10.7270/Q2RF5W11