BDBM50289553 1-Phenethyl-3-((Z)-styryl)-piperidine::CHEMBL36979
SMILES: C(Cc1ccccc1)N1CCCC(C1)\C=C/c1ccccc1
InChI Key: InChIKey=YKCREYMJRACNJN-YPKPFQOOSA-N
Data: 3 IC50
Activity Spreadsheet -- Enzyme Inhibition Constant Data from BindingDB
Found 3 hits for monomerid = 50289553
Trg + Lig
Ki
nM
ΔG°
kcal/mole
IC50
nM
Kd
nM
EC50/IC50
nM
koff
s-1
kon
M-1s-1
pHTemp
°C
D(1A) dopamine receptor
(RAT)
BDBM50289553
(1-Phenethyl-3-((Z)-styryl)-piperidine | CHEMBL3697...)
Show SMILES C(Cc1ccccc1)N1CCCC(C1)\C=C/c1ccccc1
Show InChI InChI=1S/C21H25N/c1-3-8-19(9-4-1)13-14-21-12-7-16-22(18-21)17-15-20-10-5-2-6-11-20/h1-6,8-11,13-14,21H,7,12,15-18H2/b14-13-
n/an/a 630n/an/an/an/an/an/a
TBA
Curated by ChEMBL
Assay Description
Binding affinity at dopamine D1 receptor in rat striatum by [3H]-SCH-22,390 displacement.
Bioorg Med Chem Lett 7: 1525-1530 (1997)
Article DOI: 10.1016/S0960-894X(97)00253-9
BindingDB Entry DOI: 10.7270/Q2N58MCN
Sigma non-opioid intracellular receptor 1
(RAT)
BDBM50289553
(1-Phenethyl-3-((Z)-styryl)-piperidine | CHEMBL3697...)
Show SMILES C(Cc1ccccc1)N1CCCC(C1)\C=C/c1ccccc1
Show InChI InChI=1S/C21H25N/c1-3-8-19(9-4-1)13-14-21-12-7-16-22(18-21)17-15-20-10-5-2-6-11-20/h1-6,8-11,13-14,21H,7,12,15-18H2/b14-13-
n/an/a 0.800n/an/an/an/an/an/a
TBA
Curated by ChEMBL
Assay Description
Binding affinity at sigma receptor by [3H]-(+)-SKF-10,047 displacement.
Bioorg Med Chem Lett 7: 1525-1530 (1997)
Article DOI: 10.1016/S0960-894X(97)00253-9
BindingDB Entry DOI: 10.7270/Q2N58MCN
D(2) dopamine receptor
(Rattus norvegicus (rat))
BDBM50289553
(1-Phenethyl-3-((Z)-styryl)-piperidine | CHEMBL3697...)
Show SMILES C(Cc1ccccc1)N1CCCC(C1)\C=C/c1ccccc1
Show InChI InChI=1S/C21H25N/c1-3-8-19(9-4-1)13-14-21-12-7-16-22(18-21)17-15-20-10-5-2-6-11-20/h1-6,8-11,13-14,21H,7,12,15-18H2/b14-13-
Reactome pathway
n/an/a 120n/an/an/an/an/an/a
TBA
Curated by ChEMBL
Assay Description
Binding affinity at dopamine D2 receptor in rat striatum by [3H]-Spiperone displacement.
Bioorg Med Chem Lett 7: 1525-1530 (1997)
Article DOI: 10.1016/S0960-894X(97)00253-9
BindingDB Entry DOI: 10.7270/Q2N58MCN