BDBM50289563 2-(4-{(R)-2-[(R)-2-(3-Chloro-phenyl)-2-hydroxy-ethylamino]-propyl}-phenoxy)-N-hydroxy-acetamide::CHEMBL39596
SMILES: C[C@H](Cc1ccc(OCC(=O)NO)cc1)NC[C@H](O)c1cccc(Cl)c1
InChI Key: InChIKey=SHHXPBZUARGGAY-ACJLOTCBSA-N
Data: 3 KI  1 EC50
Activity Spreadsheet -- Enzyme Inhibition Constant Data from BindingDB
Found 4 hits for monomerid = 50289563
Trg + Lig
Ki
nM
ΔG°
kcal/mole
IC50
nM
Kd
nM
EC50/IC50
nM
koff
s-1
kon
M-1s-1
pHTemp
°C
Beta-2 adrenergic receptor
(Homo sapiens (Human))
BDBM50289563
(2-(4-{(R)-2-[(R)-2-(3-Chloro-phenyl)-2-hydroxy-eth...)
Show SMILES C[C@H](Cc1ccc(OCC(=O)NO)cc1)NC[C@H](O)c1cccc(Cl)c1
Show InChI InChI=1S/C19H23ClN2O4/c1-13(21-11-18(23)15-3-2-4-16(20)10-15)9-14-5-7-17(8-6-14)26-12-19(24)22-25/h2-8,10,13,18,21,23,25H,9,11-12H2,1H3,(H,22,24)/t13-,18+/m1/s1
Reactome pathway
112n/an/an/an/an/an/an/an/a
TBA
Curated by ChEMBL
Assay Description
Ability to bind to human Beta-2 adrenergic receptor using membranes of stably transfected CHO cells
Bioorg Med Chem Lett 7: 1583-1588 (1997)
Article DOI: 10.1016/S0960-894X(97)00266-7
BindingDB Entry DOI: 10.7270/Q24749VQ
Beta-1 adrenergic receptor
(Homo sapiens (Human))
BDBM50289563
(2-(4-{(R)-2-[(R)-2-(3-Chloro-phenyl)-2-hydroxy-eth...)
Show SMILES C[C@H](Cc1ccc(OCC(=O)NO)cc1)NC[C@H](O)c1cccc(Cl)c1
Show InChI InChI=1S/C19H23ClN2O4/c1-13(21-11-18(23)15-3-2-4-16(20)10-15)9-14-5-7-17(8-6-14)26-12-19(24)22-25/h2-8,10,13,18,21,23,25H,9,11-12H2,1H3,(H,22,24)/t13-,18+/m1/s1
Reactome pathway
310n/an/an/an/an/an/an/an/a
TBA
Curated by ChEMBL
Assay Description
Ability to bind to human Beta-1 adrenergic receptor using membranes of stably transfected CHO cells
Bioorg Med Chem Lett 7: 1583-1588 (1997)
Article DOI: 10.1016/S0960-894X(97)00266-7
BindingDB Entry DOI: 10.7270/Q24749VQ
Beta-2 adrenergic receptor and beta-3 adrenergic receptor
(Homo sapiens (Human))
BDBM50289563
(2-(4-{(R)-2-[(R)-2-(3-Chloro-phenyl)-2-hydroxy-eth...)
Show SMILES C[C@H](Cc1ccc(OCC(=O)NO)cc1)NC[C@H](O)c1cccc(Cl)c1
Show InChI InChI=1S/C19H23ClN2O4/c1-13(21-11-18(23)15-3-2-4-16(20)10-15)9-14-5-7-17(8-6-14)26-12-19(24)22-25/h2-8,10,13,18,21,23,25H,9,11-12H2,1H3,(H,22,24)/t13-,18+/m1/s1
Reactome pathway
1.96E+3n/an/an/an/an/an/an/an/a
TBA
Curated by ChEMBL
Assay Description
Ability to bind to human Beta-3 adrenergic receptor using membranes of stably transfected CHO cells
Bioorg Med Chem Lett 7: 1583-1588 (1997)
Article DOI: 10.1016/S0960-894X(97)00266-7
BindingDB Entry DOI: 10.7270/Q24749VQ
Beta-3 adrenergic receptor
(Homo sapiens (Human))
BDBM50289563
(2-(4-{(R)-2-[(R)-2-(3-Chloro-phenyl)-2-hydroxy-eth...)
Show SMILES C[C@H](Cc1ccc(OCC(=O)NO)cc1)NC[C@H](O)c1cccc(Cl)c1
Show InChI InChI=1S/C19H23ClN2O4/c1-13(21-11-18(23)15-3-2-4-16(20)10-15)9-14-5-7-17(8-6-14)26-12-19(24)22-25/h2-8,10,13,18,21,23,25H,9,11-12H2,1H3,(H,22,24)/t13-,18+/m1/s1
Reactome pathway
n/an/an/an/a 1.61E+3n/an/an/an/a
TBA
Curated by ChEMBL
Assay Description
Effective concentration for stimulation of adenylyl cyclase activity in CHO-beta3 AR expressing cell membranes
Bioorg Med Chem Lett 7: 1583-1588 (1997)
Article DOI: 10.1016/S0960-894X(97)00266-7
BindingDB Entry DOI: 10.7270/Q24749VQ