BDBM50289564 (R)-1-(3-Chloro-phenyl)-2-{(R)-2-[4-(2-hydroxy-ethoxy)-phenyl]-1-methyl-ethylamino}-ethanol::CHEMBL41113
SMILES: C[C@H](Cc1ccc(OCCO)cc1)NC[C@H](O)c1cccc(Cl)c1
InChI Key: InChIKey=FSOBGMBQSLWEPZ-KUHUBIRLSA-N
Data: 3 KI  1 EC50
Activity Spreadsheet -- Enzyme Inhibition Constant Data from BindingDB
Found 4 hits for monomerid = 50289564
Trg + Lig
Ki
nM
ΔG°
kcal/mole
IC50
nM
Kd
nM
EC50/IC50
nM
koff
s-1
kon
M-1s-1
pHTemp
°C
Beta-2 adrenergic receptor
(Homo sapiens (Human))
BDBM50289564
((R)-1-(3-Chloro-phenyl)-2-{(R)-2-[4-(2-hydroxy-eth...)
Show SMILES C[C@H](Cc1ccc(OCCO)cc1)NC[C@H](O)c1cccc(Cl)c1
Show InChI InChI=1S/C19H24ClNO3/c1-14(11-15-5-7-18(8-6-15)24-10-9-22)21-13-19(23)16-3-2-4-17(20)12-16/h2-8,12,14,19,21-23H,9-11,13H2,1H3/t14-,19+/m1/s1
Reactome pathway
260n/an/an/an/an/an/an/an/a
TBA
Curated by ChEMBL
Assay Description
Ability to bind to human Beta-2 adrenergic receptor using membranes of stably transfected CHO cells
Bioorg Med Chem Lett 7: 1583-1588 (1997)
Article DOI: 10.1016/S0960-894X(97)00266-7
BindingDB Entry DOI: 10.7270/Q24749VQ
Beta-1 adrenergic receptor
(Homo sapiens (Human))
BDBM50289564
((R)-1-(3-Chloro-phenyl)-2-{(R)-2-[4-(2-hydroxy-eth...)
Show SMILES C[C@H](Cc1ccc(OCCO)cc1)NC[C@H](O)c1cccc(Cl)c1
Show InChI InChI=1S/C19H24ClNO3/c1-14(11-15-5-7-18(8-6-15)24-10-9-22)21-13-19(23)16-3-2-4-17(20)12-16/h2-8,12,14,19,21-23H,9-11,13H2,1H3/t14-,19+/m1/s1
Reactome pathway
1.25E+3n/an/an/an/an/an/an/an/a
TBA
Curated by ChEMBL
Assay Description
Ability to bind to human Beta-1 adrenergic receptor using membranes of stably transfected CHO cells
Bioorg Med Chem Lett 7: 1583-1588 (1997)
Article DOI: 10.1016/S0960-894X(97)00266-7
BindingDB Entry DOI: 10.7270/Q24749VQ
Beta-2 adrenergic receptor and beta-3 adrenergic receptor
(Homo sapiens (Human))
BDBM50289564
((R)-1-(3-Chloro-phenyl)-2-{(R)-2-[4-(2-hydroxy-eth...)
Show SMILES C[C@H](Cc1ccc(OCCO)cc1)NC[C@H](O)c1cccc(Cl)c1
Show InChI InChI=1S/C19H24ClNO3/c1-14(11-15-5-7-18(8-6-15)24-10-9-22)21-13-19(23)16-3-2-4-17(20)12-16/h2-8,12,14,19,21-23H,9-11,13H2,1H3/t14-,19+/m1/s1
Reactome pathway
2.14E+3n/an/an/an/an/an/an/an/a
TBA
Curated by ChEMBL
Assay Description
Ability to bind to human Beta-3 adrenergic receptor using membranes of stably transfected CHO cells
Bioorg Med Chem Lett 7: 1583-1588 (1997)
Article DOI: 10.1016/S0960-894X(97)00266-7
BindingDB Entry DOI: 10.7270/Q24749VQ
Beta-3 adrenergic receptor
(Homo sapiens (Human))
BDBM50289564
((R)-1-(3-Chloro-phenyl)-2-{(R)-2-[4-(2-hydroxy-eth...)
Show SMILES C[C@H](Cc1ccc(OCCO)cc1)NC[C@H](O)c1cccc(Cl)c1
Show InChI InChI=1S/C19H24ClNO3/c1-14(11-15-5-7-18(8-6-15)24-10-9-22)21-13-19(23)16-3-2-4-17(20)12-16/h2-8,12,14,19,21-23H,9-11,13H2,1H3/t14-,19+/m1/s1
Reactome pathway
n/an/an/an/a 750n/an/an/an/a
TBA
Curated by ChEMBL
Assay Description
Effective concentration for stimulation of adenylyl cyclase activity in CHO-beta3 AR expressing cell membranes
Bioorg Med Chem Lett 7: 1583-1588 (1997)
Article DOI: 10.1016/S0960-894X(97)00266-7
BindingDB Entry DOI: 10.7270/Q24749VQ