BDBM50290367 Acetic acid [1-[1-(4-fluoro-phenyl)-7-naphthalen-1-ylmethyl-4,5,6,7-tetrahydro-1H-indazol-3-yl]-meth-(E)-ylidene]-hydrazide::CHEMBL445368
SMILES: CC(=O)N\N=C\c1nn(c2C(Cc3cccc4ccccc34)CCCc12)-c1ccc(F)cc1
InChI Key: InChIKey=WZCJFYMQMXESSF-STBIYBPSSA-N
Data: 1 IC50
Activity Spreadsheet -- Enzyme Inhibition Constant Data from BindingDB
Found 1 hit for monomerid = 50290367
Trg + Lig
Ki
nM
ΔG°
kcal/mole
IC50
nM
Kd
nM
EC50/IC50
nM
koff
s-1
kon
M-1s-1
pHTemp
°C
Progesterone receptor
(Oryctolagus cuniculus)
BDBM50290367
(Acetic acid [1-[1-(4-fluoro-phenyl)-7-naphthalen-1...)
Show SMILES CC(=O)N\N=C\c1nn(c2C(Cc3cccc4ccccc34)CCCc12)-c1ccc(F)cc1
Show InChI InChI=1S/C27H25FN4O/c1-18(33)30-29-17-26-25-11-5-9-21(16-20-8-4-7-19-6-2-3-10-24(19)20)27(25)32(31-26)23-14-12-22(28)13-15-23/h2-4,6-8,10,12-15,17,21H,5,9,11,16H2,1H3,(H,30,33)/b29-17+
n/an/a>1.00E+4n/an/an/an/an/an/a
TBA
Curated by ChEMBL
Assay Description
Binding affinity determined by ability to displace [3H]-R5020 radioligand using uterine progesterone receptor obtained from estrogen-primed rabbit
Bioorg Med Chem Lett 7: 2551-2556 (1997)
Article DOI: 10.1016/S0960-894X(97)10016-6
BindingDB Entry DOI: 10.7270/Q2MW2H5C