null
SMILES: COc1ccc(CNc2nc(Cl)nc3n(Cc4ccc(cc4)-c4ccccc4)cnc23)cc1
InChI Key: InChIKey=OHCBQILFYBUKQD-UHFFFAOYSA-N
Activity Spreadsheet -- Enzyme Inhibition Constant Data from BindingDB
Found 1 hit for monomerid = 50290576
Trg + Lig
Ki
nM
ΔG°
kcal/mole
IC50
nM
Kd
nM
EC50/IC50
nM
koff
s-1
kon
M-1s-1
pHTemp
°C
Cyclin-dependent kinase 2/G1/S-specific cyclin-E1/G1/S-specific cyclin-E2
(Homo sapiens (Human))
BDBM50290576
((9-Biphenyl-4-ylmethyl-2-chloro-9H-purin-6-yl)-(4-...)
Show SMILES COc1ccc(CNc2nc(Cl)nc3n(Cc4ccc(cc4)-c4ccccc4)cnc23)cc1
Show InChI InChI=1S/C26H22ClN5O/c1-33-22-13-9-18(10-14-22)15-28-24-23-25(31-26(27)30-24)32(17-29-23)16-19-7-11-21(12-8-19)20-5-3-2-4-6-20/h2-14,17H,15-16H2,1H3,(H,28,30,31)
n/an/a>5.00E+3n/an/an/an/an/an/a
TBA
Curated by ChEMBL
Assay Description
Inhibitory concentration against cyclin dependent kinase-2 (CDK2)/Cyclin E
Bioorg Med Chem Lett 7: 2697-2702 (1997)
Article DOI: 10.1016/S0960-894X(97)10076-2
BindingDB Entry DOI: 10.7270/Q2FJ2H8Q