BDBM50290671 (S)-4-(2,5-Dioxo-pyrrolidin-1-yl)-2-mercapto-N-[(R)-1-((S)-1-methylcarbamoyl-2-phenyl-ethylcarbamoyl)-2-methylsulfanyl-ethyl]-butyramide::CHEMBL92512
SMILES: CNC(=O)[C@H](Cc1ccccc1)NC(=O)[C@H](CSC)NC(=O)[C@@H](S)CCN1C(=O)CCC1=O
InChI Key: InChIKey=RSWUWSKXIDLCIR-ULQDDVLXSA-N
Data: 6 IC50
Activity Spreadsheet -- Enzyme Inhibition Constant Data from BindingDB
Found 6 hits for monomerid = 50290671
Trg + Lig
Ki
nM
ΔG°
kcal/mole
IC50
nM
Kd
nM
EC50/IC50
nM
koff
s-1
kon
M-1s-1
pHTemp
°C
Matrix metalloproteinase-9
(Homo sapiens (Human))
BDBM50290671
((S)-4-(2,5-Dioxo-pyrrolidin-1-yl)-2-mercapto-N-[(R...)
Show SMILES CNC(=O)[C@H](Cc1ccccc1)NC(=O)[C@H](CSC)NC(=O)[C@@H](S)CCN1C(=O)CCC1=O
Show InChI InChI=1S/C22H30N4O5S2/c1-23-20(29)15(12-14-6-4-3-5-7-14)24-21(30)16(13-33-2)25-22(31)17(32)10-11-26-18(27)8-9-19(26)28/h3-7,15-17,32H,8-13H2,1-2H3,(H,23,29)(H,24,30)(H,25,31)/t15-,16-,17-/m0/s1
Reactome pathway
n/an/a 5n/an/an/an/an/an/a
TBA
Curated by ChEMBL
Assay Description
Inhibition of matrix metalloproteinase-9, MMP-9
Bioorg Med Chem Lett 7: 2765-2770 (1997)
Article DOI: 10.1016/S0960-894X(97)10069-5
BindingDB Entry DOI: 10.7270/Q29G5MTB
Stromelysin-1
(Homo sapiens (Human))
BDBM50290671
((S)-4-(2,5-Dioxo-pyrrolidin-1-yl)-2-mercapto-N-[(R...)
Show SMILES CNC(=O)[C@H](Cc1ccccc1)NC(=O)[C@H](CSC)NC(=O)[C@@H](S)CCN1C(=O)CCC1=O
Show InChI InChI=1S/C22H30N4O5S2/c1-23-20(29)15(12-14-6-4-3-5-7-14)24-21(30)16(13-33-2)25-22(31)17(32)10-11-26-18(27)8-9-19(26)28/h3-7,15-17,32H,8-13H2,1-2H3,(H,23,29)(H,24,30)(H,25,31)/t15-,16-,17-/m0/s1
Reactome pathway
n/an/a 45n/an/an/an/an/an/a
TBA
Curated by ChEMBL
Assay Description
Inhibition of matrix metalloproteinase-3, MMP-3
Bioorg Med Chem Lett 7: 2765-2770 (1997)
Article DOI: 10.1016/S0960-894X(97)10069-5
BindingDB Entry DOI: 10.7270/Q29G5MTB
Stromelysin-1
(Homo sapiens (Human))
BDBM50290671
((S)-4-(2,5-Dioxo-pyrrolidin-1-yl)-2-mercapto-N-[(R...)
Show SMILES CNC(=O)[C@H](Cc1ccccc1)NC(=O)[C@H](CSC)NC(=O)[C@@H](S)CCN1C(=O)CCC1=O
Show InChI InChI=1S/C22H30N4O5S2/c1-23-20(29)15(12-14-6-4-3-5-7-14)24-21(30)16(13-33-2)25-22(31)17(32)10-11-26-18(27)8-9-19(26)28/h3-7,15-17,32H,8-13H2,1-2H3,(H,23,29)(H,24,30)(H,25,31)/t15-,16-,17-/m0/s1
Reactome pathway
n/an/a 82n/an/an/an/an/an/a
TBA
Curated by ChEMBL
Assay Description
Inhibition of matrix metalloproteinase-3, MMP-3
Bioorg Med Chem Lett 7: 2765-2770 (1997)
Article DOI: 10.1016/S0960-894X(97)10069-5
BindingDB Entry DOI: 10.7270/Q29G5MTB
Matrix metalloproteinase-9
(Homo sapiens (Human))
BDBM50290671
((S)-4-(2,5-Dioxo-pyrrolidin-1-yl)-2-mercapto-N-[(R...)
Show SMILES CNC(=O)[C@H](Cc1ccccc1)NC(=O)[C@H](CSC)NC(=O)[C@@H](S)CCN1C(=O)CCC1=O
Show InChI InChI=1S/C22H30N4O5S2/c1-23-20(29)15(12-14-6-4-3-5-7-14)24-21(30)16(13-33-2)25-22(31)17(32)10-11-26-18(27)8-9-19(26)28/h3-7,15-17,32H,8-13H2,1-2H3,(H,23,29)(H,24,30)(H,25,31)/t15-,16-,17-/m0/s1
Reactome pathway
n/an/a 9n/an/an/an/an/an/a
TBA
Curated by ChEMBL
Assay Description
Inhibition of matrix metalloproteinase-9, MMP-9
Bioorg Med Chem Lett 7: 2765-2770 (1997)
Article DOI: 10.1016/S0960-894X(97)10069-5
BindingDB Entry DOI: 10.7270/Q29G5MTB
Neutrophil collagenase
(Homo sapiens (Human))
BDBM50290671
((S)-4-(2,5-Dioxo-pyrrolidin-1-yl)-2-mercapto-N-[(R...)
Show SMILES CNC(=O)[C@H](Cc1ccccc1)NC(=O)[C@H](CSC)NC(=O)[C@@H](S)CCN1C(=O)CCC1=O
Show InChI InChI=1S/C22H30N4O5S2/c1-23-20(29)15(12-14-6-4-3-5-7-14)24-21(30)16(13-33-2)25-22(31)17(32)10-11-26-18(27)8-9-19(26)28/h3-7,15-17,32H,8-13H2,1-2H3,(H,23,29)(H,24,30)(H,25,31)/t15-,16-,17-/m0/s1
Reactome pathway
n/an/a 10n/an/an/an/an/an/a
TBA
Curated by ChEMBL
Assay Description
Inhibition of matrix metalloproteinase-8, MMP-8
Bioorg Med Chem Lett 7: 2765-2770 (1997)
Article DOI: 10.1016/S0960-894X(97)10069-5
BindingDB Entry DOI: 10.7270/Q29G5MTB
Neutrophil collagenase
(Homo sapiens (Human))
BDBM50290671
((S)-4-(2,5-Dioxo-pyrrolidin-1-yl)-2-mercapto-N-[(R...)
Show SMILES CNC(=O)[C@H](Cc1ccccc1)NC(=O)[C@H](CSC)NC(=O)[C@@H](S)CCN1C(=O)CCC1=O
Show InChI InChI=1S/C22H30N4O5S2/c1-23-20(29)15(12-14-6-4-3-5-7-14)24-21(30)16(13-33-2)25-22(31)17(32)10-11-26-18(27)8-9-19(26)28/h3-7,15-17,32H,8-13H2,1-2H3,(H,23,29)(H,24,30)(H,25,31)/t15-,16-,17-/m0/s1
Reactome pathway
n/an/a 3n/an/an/an/an/an/a
TBA
Curated by ChEMBL
Assay Description
Inhibition of matrix metalloproteinase-8, MMP-8
Bioorg Med Chem Lett 7: 2765-2770 (1997)
Article DOI: 10.1016/S0960-894X(97)10069-5
BindingDB Entry DOI: 10.7270/Q29G5MTB