BDBM50290842 6,7-Dimethoxy-4-(4-methoxy-phenoxy)-quinoline::CHEMBL98584
SMILES: COc1ccc(Oc2ccnc3cc(OC)c(OC)cc23)cc1
InChI Key: InChIKey=GBYWCVLXEHHOFE-UHFFFAOYSA-N
Data: 1 IC50
Activity Spreadsheet -- Enzyme Inhibition Constant Data from BindingDB
Found 1 hit for monomerid = 50290842
Trg + Lig
Ki
nM
ΔG°
kcal/mole
IC50
nM
Kd
nM
EC50/IC50
nM
koff
s-1
kon
M-1s-1
pHTemp
°C
Platelet-derived growth factor receptor (PDGFr)
(Rattus norvegicus)
BDBM50290842
(6,7-Dimethoxy-4-(4-methoxy-phenoxy)-quinoline | CH...)
Show SMILES COc1ccc(Oc2ccnc3cc(OC)c(OC)cc23)cc1
Show InChI InChI=1S/C18H17NO4/c1-20-12-4-6-13(7-5-12)23-16-8-9-19-15-11-18(22-3)17(21-2)10-14(15)16/h4-11H,1-3H3
Reactome pathway
n/an/a 1.90E+3n/an/an/an/an/an/a
TBA
Curated by ChEMBL
Assay Description
Inhibition of PDGF-BB induced PDGF-B receptor autophosphorylation in rat mesangial cells.
Bioorg Med Chem Lett 7: 2935-2940 (1997)
Article DOI: 10.1016/S0960-894X(97)10117-2
BindingDB Entry DOI: 10.7270/Q20Z738R